program: Gaussian 09
title: 000070291
version: EM64L-G09RevD.01
frameworkgroup: C1[X(C9H10O2)]
method: RPBEPBE
basis: SDD
operation: Freq
keyword: #pfreq=noraman
keyword: PBEPBE/SDD
title: #p freq=noraman PBEPBE/SDD
converged: YES YES NO NO
title: Mulliken charges:
elementType: O O C C C C C C C C C H H H H H H H H H H
charge: -0.181474 -0.203545 0.248836 0.225180 0.427326 -0.121723 0.025111 -0.521519 -0.802586 -0.798749 -0.773755 0.269638 0.229861 0.231729 0.279868 0.279650 0.230374 0.231003 0.251088 0.222260 0.251428
chargesum: 0.00000
title: Mulliken charges with hydrogens summed into heavy atoms:
elementType: O O C C C C C C C C C
charge: -0.181474 -0.203545 0.248836 0.225180 0.427326 -0.121723 0.025111 -0.251881 -0.061128 -0.057723 -0.048979
polarizability: 1.33999265e+02 -1.86987289e+01 1.23102019e+02 -2.44459413e-02 5.97473532e-02 5.49737298e+01
1716.lowfreq: -0.3787 -0.0007 -0.0006 0.0010 6.3507 11.0901 44.5950 74.1202 109.0350
frequency: 44.2072 74.1139 109.0216 110.9062 125.0307 165.6064 256.6533 271.5479 296.5540 328.3072 369.3940 395.0627 408.5353 459.7253 509.6335 548.7505 623.5057 675.6104 685.9108 800.9159 808.4391 896.1952 924.2759 994.7505 1009.2138 1023.8526 1043.7272 1051.3388 1109.4488 1115.6913 1196.7902 1260.0273 1309.8888 1345.9392 1385.2868 1394.3671 1397.8524 1445.0396 1455.3382 1457.9332 1460.4984 1469.6078 1482.0296 1522.6071 1542.4938 1610.5407 1660.1672 2975.2095 2980.1093 2990.4283 3045.9449 3054.5162 3068.5468 3105.9656 3107.8820 3109.5188 3144.1253
redmass: 1.0724 3.9777 1.1206 3.1872 1.0942 3.3452 3.3297 2.6935 2.5512 4.1352 3.8533 9.0526 5.6040 7.9193 3.3211 5.7186 3.5038 3.5537 5.8965 4.5094 2.4340 1.4468 3.0634 1.5650 1.4442 1.7533 1.5448 1.6381 2.1600 4.0041 2.2365 3.6486 4.4989 3.0684 1.2620 1.2041 1.2543 1.0454 1.0840 1.0754 1.1166 1.0476 1.0477 10.6714 9.3763 8.2566 7.5161 1.0379 1.0389 1.0368 1.0963 1.0963 1.0956 1.1010 1.0977 1.0975 1.0933
irintensity: 1.5769 11.1383 0.0404 0.0414 0.1731 0.6168 0.9632 1.0471 0.6791 0.3073 0.5916 23.4853 2.4608 0.7637 0.1590 2.0445 0.4048 6.2677 6.5069 2.1268 3.3274 23.5637 8.9601 38.2245 0.8973 14.8723 5.2016 6.0494 0.5943 31.3955 18.9402 54.4706 56.8855 10.8334 38.9296 62.5125 30.5346 14.1623 6.2070 5.2930 51.6661 0.2338 39.3570 6.6101 241.1061 66.8783 11.6712 29.0261 0.9146 7.5221 29.3922 0.1776 8.5874 13.3439 3.5772 4.5744 7.3558
temp: 298.150 k
press: 1.00000 atm
elementType: 8 8 6 6 6 6 6 6 6 6 6 1 1 1 1 1 1 1 1 1 1
symmnumber: 1
zpe: 431939.1 jmol-1
zpe.correction: 0.164517 hartree
zpe.thermalcorrener: 0.176066 hartree
zpe.thermalcorrenthalpy: 0.177010 hartree
zpe.thermalcorrgfe: 0.126760 hartree
zpe.sumelectzpe: -498.583709 hartree
zpe.sumelectthermal: -498.572160 hartree
zpe.sumelectthermalent: -498.571216 hartree
zpe.sumelectthermalfe: -498.621466 hartree
dipole: -0.0189 0.8381 0.0180
dipole: 0.8385
quadrupole: -63.6567 -71.3554 -64.3272
quadrupole: 14.3868 -0.0214 0.0275
quadrupole: 2.7897 -4.9090 2.1193 14.3868 -0.0214 0.0275
hfenergy: -498.7482255 hartree
pointgroup: C01 [X(C9H10O2)]
dipole: 0.0603988 0.3228714 -0.0304839 debye
dipolederiv: -0.8666459 -0.1834781 0.0414201 -0.2242013 -0.6387663 0.0323965 0.044769 0.0302897 -0.3095267 -0.7965998 -0.2021203 0.0387171 -0.2268495 -0.7262972 0.037535 0.0400107 0.0361524 -0.3348621 -0.6598588 0.0601995 0.0307877 0.1053434 0.4140817 -0.0361339 0.0277432 -0.0362043 -0.0351228 0.458339 -0.099384 -0.0209872 -0.079139 -0.5926394 0.0394959 -0.0235817 0.0407387 -0.0449991 0.5498251 -0.0573533 -0.0282533 -0.0465913 -0.3603321 0.024434 -0.0301247 0.0253774 -0.0051625 1.0421376 0.0818117 -0.0525447 0.0430531 0.7612154 -0.0387151 -0.0506238 -0.0412969 0.1676852 0.9558062 -0.0292612 -0.0395803 0.0186092 1.0208687 -0.052072 -0.0422387 -0.0486589 0.224385 -0.6540018 0.1903229 0.0168337 0.1039303 0.1049521 -0.0203157 0.0225943 -0.025459 -0.1396233 0.0004389 0.1978046 -0.011133 0.0185231 -0.2548729 0.0191247 0.0016926 0.0164244 0.0420196 -0.2158479 0.0561218 0.0114773 0.2528252 -0.0444897 -0.0086602 0.001503 0.0028594 0.0443292 -0.3086689 0.0765499 0.0143513 0.0082094 0.0492279 -0.0023106 0.0196718 -0.0064052 0.0248733 0.0578502 0.0376595 0.0028742 0.0630513 -0.0607744 0.0096026 0.0014906 0.010873 0.1517462 0.046833 0.0426545 0.1051837 0.0170564 0.0288795 -0.0205824 0.0816447 -0.0761129 -0.0297178 0.0365022 0.0331673 -0.1124651 0.0074827 0.038817 0.0136277 -0.0877311 0.0631895 -0.0285861 0.0115178 -0.1590086 0.0111811 -0.0184784 0.112857 0.0000651 0.0035706 0.0053043 0.1193398 0.0791621 -0.0303252 0.0033302 -0.1765028 0.0500429 0.0129461 0.0120199 0.0052133 0.1192764 0.0403234 0.0146347 0.0003161 0.0383256 0.0456158 0.1042409 -0.0590383 0.091301 -0.0368917 0.0456821 0.0034313 -0.0086956 0.032702 0.0223713 -0.1151556 0.0460453 -0.0994933 -0.018889 0.0622967 0.0057433 0.0537588 0.0022959 0.0855067 0.0699648 0.0773225 0.0359408 -0.0262028 0.0678466 -0.0327059 0.0046017 0.0776609 -0.126827 0.0109654 -0.0026072 0.0170735 0.1102003 0.0470623 -0.0064641 -0.0611739 -0.0173061 0.0705629 -0.0804533 -0.0841327 -0.0471068 0.0057292 unknown
polarizability: 139.4423253|15.6179635|117.0435963|-5.6764949|-4.7704738|55.5890919 unknown
InChI: InChI=1S/C9H10O2/c1-5-4-8(10)6(2)7(3)9(5)11/h4H,1-3H3
charge 0 multiplicity 1
21 atoms
O  2.151889 1.426067 -0.188882
O  -2.036528 -2.013501 0.252607
C  -0.243634 1.155367 -0.045148
C  -1.311342 0.287082 0.067762
C  1.403072 -0.852133 -0.011945
C  1.160064 0.631465 -0.088485
C  -1.066315 -1.191185 0.147071
C  0.327829 -1.691568 0.100366
C  -0.423396 2.653316 -0.130066
C  -2.745389 0.757282 0.117726
C  2.834377 -1.320076 -0.06458
H  0.44469 -2.779724 0.160815
H  -0.970057 3.040428 0.750627
H  -1.017185 2.93324 -1.021267
H  0.555312 3.154044 -0.188864
H  -3.424875 -0.105029 0.202442
H  -3.009628 1.332407 -0.790034
H  -2.915354 1.429679 0.980454
H  3.319426 -0.983834 -0.999163
H  2.901671 -2.418057 0.002292
H  3.421672 -0.87017 0.756573
