program: Gaussian 09
title: 000004763
version: EM64L-G09RevD.01
frameworkgroup: C1[X(C12H12N2O3)]
method: RPBEPBE
basis: SDD
operation: Freq
keyword: #p
keyword: freq=noraman
keyword: PBEPBE/SDD
title: #p freq=noraman PBEPBE/SDD
converged: YES YES NO NO
title: Mulliken charges:
elementType: O O O N N C C C C C C C C C C C C H H H H H H H H H H H H
charge: -0.190644 -0.192358 -0.215601 -0.380338 -0.377183 -0.056424 -0.433738 0.472771 0.159725 0.163853 -0.731892 -0.345105 -0.389079 0.157698 -0.246753 -0.239196 -0.235785 0.241999 0.239638 0.233086 0.230825 0.228685 0.365747 0.365670 0.226823 0.252325 0.230705 0.230348 0.234198
chargesum: 0.00000
title: Mulliken charges with hydrogens summed into heavy atoms:
elementType: O O O N N C C C C C C C C C C C C
charge: -0.190644 -0.192358 -0.215601 -0.014591 -0.011513 -0.056424 0.047899 0.472771 0.159725 0.163853 -0.039295 -0.118282 -0.136754 0.157698 -0.016047 -0.008848 -0.001587
polarizability: 1.74915059e+02 -1.23096516e+01 1.51799411e+02 3.00968784e-01 -8.26980500e-01 1.10086655e+02
1716.lowfreq: -17.9558 -10.2530 -0.0004 -0.0002 0.0006 4.3574 7.1458 37.5255 78.8638
frequency: -8.2040 37.5043 78.8329 117.4183 130.9697 136.9255 155.4365 182.0792 198.8242 240.0336 263.8781 309.9799 332.0463 356.6014 372.5017 399.7175 446.3563 478.7633 492.0080 529.5883 601.3879 615.5972 629.5519 652.9035 677.8172 699.9747 703.1642 711.5393 747.5245 765.9886 787.8662 791.3453 845.6610 902.6570 908.6818 953.0754 958.8523 975.6816 990.4597 992.7099 998.7232 1031.3775 1073.6199 1086.3054 1128.9531 1138.8539 1163.8694 1176.9399 1201.7116 1205.3130 1285.6810 1298.9700 1326.3940 1331.9948 1363.8079 1375.5895 1377.5021 1380.1514 1394.1515 1435.1836 1456.5730 1480.0618 1483.1084 1485.2909 1593.3432 1607.3025 1619.2721 1657.5870 1676.3746 2985.4416 3019.1091 3069.4221 3084.8618 3096.0147 3126.1249 3135.2835 3148.1313 3164.3690 3179.4232 3517.5337 3519.5171
redmass: 3.8246 9.1669 5.5737 2.7435 5.1066 5.8481 6.0080 6.0830 1.2432 3.5327 5.6220 2.1716 4.0160 11.7838 10.8623 2.7814 4.7291 9.6890 3.5813 6.4086 8.4816 6.4072 3.9396 2.6083 2.7146 1.6600 7.2417 4.8327 1.6737 1.6276 1.6302 1.5722 1.2628 5.5836 1.4887 1.9878 2.1995 1.3987 4.6584 4.0380 1.3263 2.3779 2.7488 1.9189 2.6228 2.2829 3.7792 1.0513 1.1303 4.5343 3.5119 1.2419 1.3568 1.5208 10.2146 2.1110 1.4299 6.6557 1.2235 2.1664 1.1160 1.0499 2.0544 1.0422 6.0311 6.0625 7.1984 8.9550 5.3765 1.0362 1.0593 1.1007 1.0981 1.1041 1.0858 1.0878 1.0935 1.0980 1.0964 1.0757 1.0780
irintensity: 0.0636 0.8351 0.5780 0.0299 4.3037 0.3877 6.7744 1.4983 0.4679 0.2596 4.1215 2.8677 0.9861 26.8580 5.6790 0.0044 11.3994 15.6592 9.9780 17.9293 0.8048 0.0629 0.8238 4.3066 29.8182 53.0204 1.7939 8.7378 8.3872 14.9284 231.3638 20.7173 0.0060 7.1782 0.4200 0.1701 8.1923 0.0422 5.5185 2.1394 0.0291 10.0554 5.6580 2.6096 3.4795 1.9332 6.3195 0.2780 1.7476 45.0016 309.0050 13.5240 0.5782 51.1695 261.1066 3.1396 2.6628 0.8185 15.0289 7.0063 17.1722 7.4530 24.4307 16.1607 2.2142 7.3888 309.8647 64.5255 608.4817 24.4926 15.5216 7.0943 31.1875 18.5052 4.5815 1.6872 23.8831 26.9526 8.2255 86.6459 45.9800
temp: 298.150 k
press: 1.00000 atm
elementType: 8 8 8 7 7 6 6 6 6 6 6 6 6 6 6 6 6 1 1 1 1 1 1 1 1 1 1 1 1
symmnumber: 1
zpe: 586476.1 jmol-1
zpe.correction: 0.223377 hartree
zpe.thermalcorrener: 0.237505 hartree
zpe.thermalcorrenthalpy: 0.238450 hartree
zpe.thermalcorrgfe: 0.182524 hartree
zpe.sumelectzpe: -798.476202 hartree
zpe.sumelectthermal: -798.462074 hartree
zpe.sumelectthermalent: -798.461130 hartree
zpe.sumelectthermalfe: -798.517055 hartree
dipole: -1.4489 0.2306 -0.0054
dipole: 1.4671
quadrupole: -93.6958 -95.8302 -111.5723
quadrupole: 6.1862 0.2109 -0.2061
quadrupole: 6.6703 4.5359 -11.2062 6.1862 0.2109 -0.2061
hfenergy: -798.6995791 hartree
pointgroup: C01 [X(C12H12N2O3)]
dipole: -0.5728965 -0.070403 0.0016734 debye
polarizability: 175.7617754|11.4602269|150.9678524|-0.2001194|0.12706|110.0714973 unknown
InChI: InChI=1S/C12H12N2O3/c1-2-12(8-6-4-3-5-7-8)9(15)13-11(17)14-10(12)16/h3-7,13-14H,2H2,1H3
charge 0 multiplicity 1
29 atoms
O  0.66068 -0.656413 -2.451389
O  0.635372 -0.831434 2.404719
O  3.272865 2.215448 0.097246
N  1.89327 0.794096 -1.143916
N  1.875673 0.714439 1.218979
C  0.236149 -0.742805 -0.025634
C  0.219083 -2.301624 -0.081566
C  -1.191416 -0.110239 -0.00676
C  0.932667 -0.224724 -1.304646
C  0.918693 -0.31691 1.295485
C  1.624624 -2.935918 -0.117434
C  -1.3272 1.303377 -0.011045
C  -2.360491 -0.906408 0.020783
C  2.403512 1.310445 0.06034
C  -2.602129 1.905969 0.010405
C  -3.637848 -0.302158 0.04215
C  -3.765371 1.103896 0.03728
H  -0.343097 -2.598176 -0.984326
H  -0.322224 -2.663145 0.810063
H  2.194101 -2.623773 -1.011573
H  2.212531 -2.683747 0.783883
H  1.538489 -4.035962 -0.152997
H  2.303969 1.180927 -2.000378
H  2.271692 1.044016 2.105683
H  -0.441116 1.948601 -0.033775
H  -2.291318 -1.996629 0.024793
H  -2.687029 2.998031 0.005642
H  -4.532804 -0.933517 0.062534
H  -4.756724 1.569338 0.053755
