program: Gaussian 09
title: 000070273
version: EM64L-G09RevD.01
frameworkgroup: C1[X(C7H12O2)]
method: RPBEPBE
basis: SDD
operation: Freq
keyword: #pfreq=noraman
keyword: PBEPBE/SDD
title: #p freq=noraman PBEPBE/SDD
converged: YES YES NO NO
title: Mulliken charges:
elementType: O O C C C C C C C H H H H H H H H H H H H
charge: -0.266064 -0.252901 0.021156 -0.472419 -0.449366 -0.427409 -0.431583 0.284598 -0.757152 0.240955 0.228103 0.215685 0.208036 0.250245 0.221627 0.212843 0.212277 0.224512 0.245926 0.246811 0.244117
chargesum: 0.00000
title: Mulliken charges with hydrogens summed into heavy atoms:
elementType: O O C C C C C C C
charge: -0.266064 -0.252901 0.262111 -0.028630 0.008916 0.007061 0.005206 0.284598 -0.020297
polarizability: 9.81832141e+01 -6.37470709e-01 7.43191586e+01 -1.01389565e+00 -2.71199289e+00 6.48452791e+01
1716.lowfreq: -55.8711 -13.2920 -4.5088 0.0004 0.0004 0.0006 16.3514 27.8242 46.4245
frequency: -55.4093 27.4325 46.3840 90.7824 110.1120 207.5503 308.4343 339.1956 448.4926 520.8424 569.2836 619.2847 637.8853 761.0982 808.5658 840.4651 868.2552 896.7159 955.5021 965.0408 972.0203 985.8764 1010.6005 1040.8969 1065.5764 1119.1286 1165.4787 1171.2759 1206.0075 1218.8987 1229.2555 1270.1463 1277.3469 1291.7954 1296.9085 1317.9912 1345.2781 1381.7070 1453.2211 1455.5712 1466.9689 1475.4891 1478.1476 1494.6656 1647.8598 3001.0346 3005.1471 3007.4459 3007.7055 3019.3316 3027.1310 3052.4516 3073.2680 3082.5232 3095.6413 3095.8660 3142.3446
redmass: 1.6143 1.1057 4.7502 2.6013 3.1346 3.1531 3.8823 4.1436 2.2115 3.6429 3.1032 2.8850 4.3360 1.2079 1.4775 4.9693 4.4704 2.5331 1.6436 1.5692 1.4856 1.9365 3.1642 1.6653 2.7130 2.7574 1.4952 1.3003 2.9627 1.5940 1.1910 1.3186 1.2090 1.2883 1.3116 1.5032 1.4437 1.2567 1.0633 1.0474 1.0800 1.0870 1.0835 1.0979 9.2954 1.0590 1.0653 1.0388 1.0605 1.0685 1.0810 1.1009 1.1022 1.1026 1.1028 1.0984 1.1010
irintensity: 0.0646 1.5317 0.9491 2.0794 2.2746 6.0920 2.7633 5.1838 1.0364 6.1868 3.1761 1.1856 3.1644 10.4710 0.1320 5.0162 11.5391 13.8106 14.0007 2.9047 0.7496 0.2644 149.4952 9.3883 6.8541 6.3088 3.6082 9.4368 312.5665 33.1245 1.1068 0.1444 3.0335 2.8008 7.5348 0.1324 6.7990 52.0909 27.7403 18.4262 2.4906 12.2409 12.2737 4.8167 184.6187 5.3314 36.5942 1.4360 47.8948 43.8812 10.8175 13.0085 11.9981 31.8872 50.5873 27.9061 11.5206
temp: 298.150 k
press: 1.00000 atm
elementType: 8 8 6 6 6 6 6 6 6 1 1 1 1 1 1 1 1 1 1 1 1
symmnumber: 1
zpe: 469350.8 jmol-1
zpe.correction: 0.178766 hartree
zpe.thermalcorrener: 0.187896 hartree
zpe.thermalcorrenthalpy: 0.188840 hartree
zpe.thermalcorrgfe: 0.142740 hartree
zpe.sumelectzpe: -423.678106 hartree
zpe.sumelectthermal: -423.668976 hartree
zpe.sumelectthermalent: -423.668032 hartree
zpe.sumelectthermalfe: -423.714132 hartree
dipole: 1.0630 -1.4437 1.0314
dipole: 2.0683
quadrupole: -49.7533 -57.7625 -54.4554
quadrupole: 4.4483 -3.4918 2.5769
quadrupole: 4.2371 -3.7721 -0.4650 4.4483 -3.4918 2.5769
hfenergy: -423.856872 hartree
pointgroup: C01 [X(C7H12O2)]
dipole: 0.4339524 -0.5251783 0.445026 debye
dipolederiv: -1.7114088 0.1627086 -0.1523831 0.2658908 -0.4957048 0.1198835 -0.1097895 0.1081818 -0.3611065 -0.6908631 -0.0399627 0.0397558 0.2821342 -0.6994148 0.3070714 -0.2083073 0.3092834 -0.5487569 0.8736542 0.0125638 0.0310398 0.1270284 0.2649544 0.0383982 -0.1116651 0.0863074 0.2889331 -0.086676 0.0097663 -0.0148029 -0.0191576 0.0029116 0.026933 -0.0160859 -0.0356575 0.1363549 -0.1204344 -0.0243289 -0.0001507 0.0051829 -0.031468 -0.1015911 0.0109852 -0.071995 0.0627116 0.0500264 -0.0232058 0.0162524 0.0116437 0.0129714 -0.0309389 -0.0230416 -0.0050719 0.152678 0.0347074 0.0281905 0.0303289 -0.0089468 0.0633206 -0.0328544 -0.0119978 -0.0666938 0.1310954 1.7659757 -0.0847576 0.0153345 -0.5339507 0.8574474 -0.5299254 0.3042633 -0.5105677 0.5847389 -0.2966892 -0.1204167 0.1092864 -0.1752911 -0.0843604 0.1037412 0.1641523 0.1047838 -0.0597265 -0.0112844 0.0100883 -0.0374271 -0.0422549 0.0286254 0.0380917 0.0253237 0.0098718 -0.0986172 0.0597763 -0.0205295 -0.0119255 -0.0094131 -0.0845499 -0.112925 -0.0078971 -0.1410794 -0.0226113 0.0490231 -0.027086 0.0347067 -0.0122039 0.0417353 0.0538083 0.0243485 0.1139434 -0.097392 0.043346 -0.0193184 0.0419843 -0.0245495 0.0612931 0.0727358 0.0543769 0.0098136 -0.1266495 0.0250317 0.0951802 -0.0018249 0.080703 -0.0857014 0.0044911 -0.0083355 0.0374434 0.0765868 0.0184964 -0.0057687 0.0669547 -0.0129551 0.0406308 0.0027775 0.1357053 -0.0232207 -0.1398968 -0.1012437 0.0851216 -0.0738225 0.0752777 0.0064683 0.0408725 -0.1252388 0.0608667 0.0131741 -0.044039 -0.0552497 -0.0936341 -0.0281776 0.0343719 -0.0540702 -0.1207815 -0.0897647 -0.0765652 0.0264535 -0.0213622 0.0388713 -0.0536485 -0.0637795 0.0831826 0.083479 0.1306446 -0.0429093 0.0888184 -0.021124 -0.0393585 0.0042258 0.1304599 -0.0174039 0.0004561 -0.002128 -0.0792284 0.0894735 0.012128 0.026472 -0.0204714 -0.061936 -0.0540802 -0.0067349 -0.0693957 0.1108279 -0.0621438 0.0473629 -0.0256576 0.0889335 0.0617245 0.0418021 -0.0532152 0.0444348 0.0963589 unknown
polarizability: 98.2166902|0.4012469|73.9608268|-0.2929349|-3.2716499|65.1701349 unknown
InChI: InChI=1S/C7H12O2/c1-6(8)9-7-4-2-3-5-7/h7H,2-5H2,1H3
charge 0 multiplicity 1
21 atoms
O  -0.895387 -0.659138 0.226283
O  -2.034458 1.01431 -0.938681
C  0.407123 -0.137154 -0.287502
C  1.47464 -1.233253 -0.137046
C  0.946203 1.039582 0.554034
C  2.815973 -0.446464 -0.189128
C  2.479511 1.016342 0.282548
C  -2.050235 0.017697 -0.180678
C  -3.278892 -0.631676 0.421405
H  0.259482 0.168429 -1.340123
H  1.398747 -2.014638 -0.912129
H  1.33808 -1.71879 0.847257
H  0.734682 0.827444 1.619448
H  0.469838 1.998533 0.2929
H  3.216465 -0.43349 -1.219024
H  3.582957 -0.921166 0.447018
H  3.048048 1.299101 1.185514
H  2.746387 1.743373 -0.50536
H  -3.2190 -0.607991 1.523364
H  -3.336411 -1.691591 0.119109
H  -4.180952 -0.099459 0.087091
