program: Gaussian 09
title: 000070263
version: EM64L-G09RevD.01
frameworkgroup: C1[X(C8H12)]
method: RPBEPBE
basis: SDD
operation: Freq
keyword: #p
keyword: freq=noraman
keyword: PBEPBE/SDD
title: #p freq=noraman PBEPBE/SDD
converged: YES YES YES YES
title: Mulliken charges:
elementType: C C C C C C C C H H H H H H H H H H H H
charge: -0.178199 -0.416060 -0.416076 -0.400980 -0.400981 -0.381570 0.210446 -0.541264 0.221053 0.211571 0.193457 0.193457 0.211575 0.218124 0.196789 0.196790 0.218126 0.185049 0.201047 0.277647
chargesum: 0.00000
title: Mulliken charges with hydrogens summed into heavy atoms:
elementType: C C C C C C C C
charge: 0.042854 -0.011032 -0.011044 0.013932 0.013935 0.004526 0.210446 -0.263617
polarizability: 9.00721169e+01 1.79922663e-03 7.05997908e+01 1.04652669e+01 1.58096811e-03 7.52278398e+01
1716.lowfreq: -20.3134 -9.3028 0.0004 0.0007 0.0008 5.0147 104.6431 130.4028 236.2367
frequency: 104.6419 130.3712 236.2367 239.8766 341.2701 374.6279 406.0845 477.6774 542.1316 625.6214 634.4819 637.0800 764.4571 780.1283 816.8773 858.7662 863.3777 927.9944 932.3549 1003.6482 1042.7295 1051.6044 1087.3619 1109.6920 1124.1117 1146.8095 1226.9392 1251.0304 1267.0625 1278.3238 1302.8335 1326.8073 1337.1318 1348.0348 1348.0717 1353.8843 1456.0488 1460.4917 1461.8114 1468.0361 1477.2507 2125.8699 2963.0664 2964.5694 2975.4028 2979.2069 2980.0250 2987.0404 3028.0874 3034.7569 3041.7946 3046.9406 3052.7135 3427.5504
redmass: 3.4337 3.0997 2.3709 1.9927 2.9021 2.1518 3.0329 1.7716 4.4203 1.9048 1.2189 1.5473 3.2535 1.4814 2.4079 1.6573 2.4669 1.3741 2.2893 2.5302 1.5623 1.8234 1.7610 1.0667 1.7871 1.6257 1.3012 1.3706 1.2457 1.3330 1.5791 1.3078 1.4297 1.3818 1.4556 1.4845 1.0822 1.0863 1.0860 1.0809 1.0916 6.0742 1.0628 1.0741 1.0619 1.0625 1.0613 1.0723 1.0960 1.0996 1.0998 1.1021 1.1028 1.1573
irintensity: 0.1132 0.1016 0.6682 1.8353 3.3198 0.1892 0.6064 2.5354 1.5615 29.5033 74.0114 47.5565 1.4424 0.4915 0.1232 8.7195 6.5949 8.6066 0.0692 9.6353 0.2129 0.2770 0.1137 0.0727 1.4300 1.2028 0.7845 0.0008 0.6884 2.2950 2.7757 0.0333 0.0492 3.4355 0.8407 1.8892 3.3317 12.7675 7.3016 15.7841 7.1291 10.9833 40.4368 6.6360 9.7305 32.8922 49.5752 68.7406 57.5954 72.9516 21.3744 15.6909 105.7094 61.6408
temp: 298.150 k
press: 1.00000 atm
elementType: 6 6 6 6 6 6 6 6 1 1 1 1 1 1 1 1 1 1 1 1
symmnumber: 1
zpe: 461942.7 jmol-1
zpe.correction: 0.175945 hartree
zpe.thermalcorrener: 0.183863 hartree
zpe.thermalcorrenthalpy: 0.184807 hartree
zpe.thermalcorrgfe: 0.144043 hartree
zpe.sumelectzpe: -311.363208 hartree
zpe.sumelectthermal: -311.355290 hartree
zpe.sumelectthermalent: -311.354346 hartree
zpe.sumelectthermalfe: -311.395110 hartree
dipole: 0.8175 -0.0008 0.4396
dipole: 0.9282
quadrupole: -49.6111 -50.1963 -47.4401
quadrupole: 0.0032 2.1217 0.0018
quadrupole: -0.5286 -1.1138 1.6424 0.0032 2.1217 0.0018
hfenergy: -311.5391532 hartree
pointgroup: C01 [X(C8H12)]
dipole: 0.3197121 -0.0003242 0.176464 debye
dipolederiv: 0.1385233 0.0000101 0.0147984 0.0000679 0.0751744 -0.0000252 0.0200555 -0.000056 0.1544227 0.0938411 -0.0212112 0.0388733 -0.0652665 0.0934193 -0.0458848 -0.0084599 -0.0038864 0.0825151 0.0938148 0.0211684 0.0388842 0.0652487 0.0933962 0.0459084 -0.0083346 0.0039136 0.0826033 0.0757206 -0.0055841 0.0427111 -0.0036109 0.0521391 0.0007321 0.0209854 0.0136909 0.0716344 0.0757192 0.0055447 0.0427182 0.0036001 0.0521581 -0.0007358 0.0209926 -0.0137092 0.0716189 0.1103902 -0.0000021 0.0362128 -0.0000161 0.0294342 -0.0000603 0.0600121 -0.0000529 0.135769 0.1630895 -0.0000603 0.129314 -0.0002126 -0.1403563 -0.0001716 0.2585988 -0.0000813 0.0742665 -0.5541391 0.0000814 -0.0521398 0.000239 -0.3460779 0.0001589 -0.1509399 0.0000532 -0.3942685 -0.0443362 -0.0000632 0.0549037 -0.0000644 0.0635737 0.0001419 0.0665287 0.0001332 -0.1404643 -0.0181552 -0.1277288 0.0552365 -0.1028244 -0.1287206 0.032426 0.0328192 0.0053498 0.0614116 -0.0717421 0.0509732 -0.1436282 0.0357301 0.0662982 -0.0217437 -0.0916777 0.0063409 -0.1200278 -0.0716943 -0.050864 -0.1437 -0.0356645 0.0662395 0.0219095 -0.0917267 -0.0061669 -0.1200246 -0.0182605 0.12771 0.0554056 0.102833 -0.128563 -0.0326297 0.0329468 -0.0055656 0.0613674 -0.0113487 -0.0558788 -0.1080572 -0.0309497 0.0692795 0.0198 -0.0894763 -0.0147276 -0.0933793 -0.0429607 0.134555 0.0303114 0.1237284 -0.1548958 -0.0182859 0.029621 -0.0041483 0.0698786 -0.0428435 -0.1345459 0.0301384 -0.123714 -0.1550412 0.0180213 0.0294674 0.0038847 0.0699063 -0.0113944 0.0559744 -0.1079785 0.031019 0.0693278 -0.0196517 -0.0894441 0.0148823 -0.0933885 -0.0552937 0.0000483 -0.1043812 0.0000987 0.0175684 0.000036 -0.185506 0.0000165 -0.0774642 -0.0456088 -0.0000999 0.1265822 -0.0001321 0.0389451 0.0001305 0.1787036 0.0001434 -0.1223369 0.2366786 -0.000027 -0.036205 -0.0001096 0.2667014 -0.0000759 -0.0351661 -0.0000142 0.2259601 unknown
polarizability: 89.8415283|0.0001925|70.5997892|10.6250438|0.0014807|75.45843 unknown
InChI: InChI=1S/C8H12/c1-2-8-6-4-3-5-7-8/h1,8H,3-7H2
charge 0 multiplicity 1
20 atoms
C  -0.596826 -0.000643 0.916158
C  0.294197 -1.279112 0.80477
C  0.293585 1.27838 0.806345
C  1.146208 -1.277431 -0.485382
C  1.145619 1.27867 -0.483789
C  2.013817 0.000879 -0.586528
C  -1.675895 -0.000295 -0.097423
C  -2.587354 -0.000206 -0.930342
H  -1.082734 -0.001373 1.91389
H  -0.341473 -2.183002 0.848436
H  0.963652 -1.302435 1.689012
H  0.963016 1.300927 1.690623
H  -0.342507 2.181919 0.851101
H  0.473732 -1.336213 -1.364269
H  1.787823 -2.179462 -0.509138
H  1.78683 2.181019 -0.506434
H  0.47312 1.338231 -1.362597
H  2.761436 0.000542 0.234352
H  2.581792 0.001605 -1.536937
H  -3.380337 -0.000598 -1.655245
