program: Gaussian 09
title: 000070255
version: EM64L-G09RevD.01
frameworkgroup: C1[X(C4H6N2)]
method: RPBEPBE
basis: SDD
operation: Freq
keyword: #p
keyword: freq=noraman
keyword: PBEPBE/SDD
title: #p freq=noraman PBEPBE/SDD
converged: NO NO NO NO
title: Mulliken charges:
elementType: N N C C C C H H H H H H
charge: -0.073580 -0.059864 -0.177683 -0.585040 -0.306224 -0.285999 0.260459 0.251889 0.251892 0.219226 0.250857 0.254066
chargesum: 0.00000
title: Mulliken charges with hydrogens summed into heavy atoms:
elementType: N N C C C C
charge: -0.073580 -0.059864 0.082776 0.137967 -0.055367 -0.031933
polarizability: 6.72950096e+01 6.43528519e-01 5.73335905e+01 -1.09178246e-03 6.71909359e-04 2.85609449e+01
1716.lowfreq: -12.4885 -0.0010 -0.0007 0.0007 14.5404 18.7573 35.0992 216.6821 354.8333
frequency: 34.1006 216.6661 354.8298 608.7150 637.5624 675.0985 744.9695 816.0761 873.2975 905.2739 934.5333 1008.1775 1065.7551 1078.6959 1123.8395 1197.0807 1257.2264 1299.3478 1388.6523 1409.7978 1441.1477 1457.8737 1490.8872 1497.8072 3003.1523 3094.5341 3118.4871 3218.5735 3226.2676 3252.0985
redmass: 1.1135 2.8864 2.7113 3.2804 4.5937 4.6098 1.2181 1.2738 1.3726 5.9394 3.2644 1.5897 1.3656 1.7439 1.3172 1.6043 4.6989 2.7032 3.5664 3.0061 1.4232 1.0415 1.5175 1.8921 1.0333 1.1023 1.1015 1.0908 1.0975 1.1102
irintensity: 0.5725 8.3074 5.3695 6.4395 2.9631 6.2175 111.2551 9.7740 1.2326 2.0848 15.4585 7.3781 10.8066 21.5291 1.8014 3.9246 9.4747 3.4035 20.6818 1.8147 3.1864 14.8612 18.8783 14.5577 43.7664 19.7295 13.3750 1.1752 4.5458 2.2412
temp: 298.150 k
press: 1.00000 atm
elementType: 7 7 6 6 6 6 1 1 1 1 1 1
symmnumber: 1
zpe: 253790.9 jmol-1
zpe.correction: 0.096664 hartree
zpe.thermalcorrener: 0.102197 hartree
zpe.thermalcorrenthalpy: 0.103141 hartree
zpe.thermalcorrgfe: 0.066966 hartree
zpe.sumelectzpe: -265.048024 hartree
zpe.sumelectthermal: -265.042491 hartree
zpe.sumelectthermalent: -265.041546 hartree
zpe.sumelectthermalfe: -265.077722 hartree
dipole: 1.3372 2.1870 0.0002
dipole: 2.5634
quadrupole: -27.9899 -36.1938 -38.3319
quadrupole: 1.5455 -0.0001 0.0000
quadrupole: 6.1819 -2.0219 -4.1600 1.5455 -0.0001 0.0000
hfenergy: -265.1446878 hartree
pointgroup: C01 [X(C4H6N2)]
dipole: -0.5062516 -0.8722518 0.0000676 debye
dipolederiv: -0.6185137 0.020895 -0.000004 -0.0356545 -0.0016977 0.0000454 0.0000532 -0.0000116 -0.0957699 -0.1118875 0.1523883 -0.0000312 0.2836898 -0.3326073 -0.0000342 -0.0000098 0.0000168 -0.196981 0.3586652 -0.0415688 0.0000175 -0.2074158 -0.078894 -0.0000042 -0.0000161 -0.0000498 -0.1830138 0.5329424 -0.0420065 -0.0000239 0.0007748 0.1497243 0.0000063 -0.000015 0.0000024 0.2021144 -0.2090437 -0.0611766 0.0000275 -0.1465211 -0.1154452 0.0000055 -0.0000052 0.000009 -0.2466199 -0.0479611 0.0005857 0.0000292 0.1054314 0.2595834 -0.0000307 0.0000096 -0.000003 -0.1472269 0.0781369 -0.0675689 -0.0000066 -0.0497442 -0.0103175 0.0000022 0.0000029 0.0000344 0.2279213 -0.0192725 0.0140141 0.0328126 0.0710967 0.0692975 -0.0911337 0.1022559 -0.0761608 -0.0429559 -0.019255 0.014017 -0.0328044 0.0711268 0.0692701 0.0911506 -0.1022436 0.0761795 -0.042914 0.0371838 -0.001578 0.000004 -0.0964135 -0.0983561 -0.0000236 -0.0000056 -0.00002 0.1268404 -0.0039937 0.0834688 -0.0000168 0.0894123 0.0651867 0.000007 -0.0000096 0.000004 0.2151053 0.0229987 -0.07147 -0.0000039 -0.0857826 0.0242556 0.0000093 -0.0000167 -0.000001 0.1835001 unknown
polarizability: 67.2603269|0.8708702|57.3682732|0.0011069|-0.0006467|28.5609449 unknown
InChI: InChI=1S/C4H6N2/c1-6-4-2-3-5-6/h2-4H,1H3
charge 0 multiplicity 1
12 atoms
N  -0.698007 -0.063868 -0.000026
N  -0.007571 1.140991 -0.000096
C  0.152084 -1.158738 -0.000085
C  -2.161874 -0.047698 0.000013
C  1.463084 -0.652118 0.000078
C  1.310521 0.769222 -0.000061
H  -0.221379 -2.180744 -0.000073
H  -2.535865 0.474905 0.896445
H  -2.535882 0.475082 -0.896308
H  -2.53582 -1.083832 -0.000085
H  2.38716 -1.225214 0.000167
H  2.080249 1.539013 -0.00007
