program: Gaussian 09
title: 000004760
version: EM64L-G09RevD.01
frameworkgroup: C1[X(C15H10O2)]
method: RPBEPBE
basis: SDD
operation: Freq
keyword: #pfreq=noraman
keyword: PBEPBE/SDD
title: #p freq=noraman PBEPBE/SDD
converged: YES YES NO NO
title: Mulliken charges:
elementType: O O C C C C C C C C C C C C C C C H H H H H H H H H H
charge: -0.147147 -0.156755 -0.493580 -0.063441 0.002367 0.252259 0.216762 0.542198 -0.369263 -0.362283 -0.405504 -0.368861 -0.208067 -0.206597 -0.227929 -0.229036 -0.240927 0.279888 0.280647 0.279571 0.234265 0.226370 0.242087 0.241914 0.226710 0.225416 0.228935
chargesum: 0.00000
title: Mulliken charges with hydrogens summed into heavy atoms:
elementType: O O C C C C C C C C C C C C C C C
charge: -0.147147 -0.156755 -0.213692 -0.063441 0.002367 0.252259 0.216762 0.542198 -0.088615 -0.082712 -0.171238 -0.142491 0.034020 0.035317 -0.001218 -0.003620 -0.011993
polarizability: 2.30749664e+02 8.46022790e+00 1.46316138e+02 -1.48676062e+01 -5.89773171e+00 1.08108661e+02
1716.lowfreq: -6.2426 -0.0007 -0.0006 -0.0005 3.3710 5.8399 15.8358 21.5789 72.9784
frequency: 15.6630 21.5249 72.9726 120.6831 133.9879 179.5089 224.4792 237.1951 267.1090 331.5076 390.8092 401.8945 434.4488 477.1305 499.8808 523.4583 524.3580 588.9391 601.9866 619.2052 678.2417 683.9384 701.3469 747.7095 769.2759 770.3454 796.2620 840.5355 848.3107 859.3380 910.2116 918.5685 973.3647 974.1738 985.3631 990.8849 995.0926 1006.3414 1013.6538 1026.5970 1061.5071 1080.5165 1084.9972 1167.6608 1170.2419 1173.3370 1184.0326 1190.9246 1193.8902 1228.2420 1256.5466 1279.2297 1331.7274 1381.6716 1407.6291 1440.8809 1451.4369 1452.9703 1483.9861 1589.4700 1594.4076 1598.1276 1611.7494 1629.6725 1656.9688 2987.8735 3122.3401 3126.3247 3137.7778 3137.9927 3148.9474 3151.3705 3162.9219 3165.4576 3172.4825
redmass: 4.1081 6.3246 5.8336 5.1540 7.8133 5.3510 4.8525 6.7110 5.9710 9.5438 3.6145 2.7861 4.5166 4.1295 3.8912 8.1576 9.6303 6.8370 3.7318 6.1061 5.5104 5.6184 1.6837 2.2077 2.0070 2.6806 3.1078 4.0515 1.2649 3.5193 1.4305 1.6470 2.7927 1.7969 1.4252 5.9270 1.3359 2.6262 1.3635 2.3342 2.7607 2.4074 1.6543 1.5356 1.1190 1.0676 1.3541 1.6054 1.2142 2.8938 4.2816 1.6357 1.2781 8.6097 8.0623 2.2030 2.5086 2.5475 2.2719 7.4231 6.1969 7.6510 6.1916 10.5476 12.5628 1.0807 1.0854 1.0876 1.0865 1.0921 1.0965 1.0902 1.0956 1.1017 1.1004
irintensity: 0.7968 3.2491 1.4208 0.1243 4.8567 0.5400 0.7389 0.2277 1.8567 7.3566 0.4091 0.1183 0.4827 5.9704 17.4662 0.1669 0.3482 32.6673 2.1641 3.2293 2.5545 2.5719 50.0021 32.7107 52.5866 22.2685 18.9980 1.0295 0.4315 7.6414 0.0303 0.3199 5.9215 2.6683 3.2525 3.7146 0.0773 4.7776 0.0315 2.9566 29.2970 1.0493 11.5918 12.3902 19.3402 0.3039 3.5861 5.6025 3.2171 40.5233 270.7836 5.7322 4.7763 0.3275 10.0361 10.2526 0.8336 0.3156 26.2106 148.4158 7.7566 1.4964 6.0411 168.7784 71.3499 5.2431 5.8834 0.4447 1.7648 17.9107 37.6718 3.8964 4.7404 22.7260 24.9446
temp: 298.150 k
press: 1.00000 atm
elementType: 8 8 6 6 6 6 6 6 6 6 6 6 6 6 6 6 6 1 1 1 1 1 1 1 1 1 1
symmnumber: 1
zpe: 533364.7 jmol-1
zpe.correction: 0.203148 hartree
zpe.thermalcorrener: 0.216265 hartree
zpe.thermalcorrenthalpy: 0.217209 hartree
zpe.thermalcorrgfe: 0.161044 hartree
zpe.sumelectzpe: -726.894824 hartree
zpe.sumelectthermal: -726.881706 hartree
zpe.sumelectthermalent: -726.880762 hartree
zpe.sumelectthermalfe: -726.936927 hartree
dipole: -3.1395 0.0794 1.2676
dipole: 3.3867
quadrupole: -72.1474 -109.0338 -93.9295
quadrupole: 1.2516 -3.0962 -5.8570
quadrupole: 19.5562 -17.3302 -2.2259 1.2516 -3.0962 -5.8570
hfenergy: -727.0979714 hartree
pointgroup: C01 [X(C15H10O2)]
dipole: 1.2371817 -0.0020049 -0.4947216 debye
polarizability: 230.7736542|-9.6735776|146.9366712|-13.8694057|3.7965956|107.4641372 unknown
InChI: InChI=1S/C15H10O2/c16-14-11-8-4-5-9-12(11)15(17)13(14)10-6-2-1-3-7-10/h1-9,13H
charge 0 multiplicity 1
27 atoms
O  0.235644 -2.263068 1.215266
O  0.056998 2.480201 0.149065
C  -0.420488 0.137508 0.913228
C  0.515823 -1.096134 0.842298
C  0.429318 1.290919 0.297346
C  1.820748 -0.650441 0.265145
C  1.767052 0.729336 -0.06066
C  -1.789419 -0.023829 0.261092
C  2.988178 -1.408762 0.035212
C  2.878648 1.389304 -0.626126
C  -2.907141 0.661036 0.797544
C  -1.958283 -0.80543 -0.909907
C  4.103026 -0.752334 -0.533331
C  4.048661 0.632292 -0.861135
C  -4.172505 0.567348 0.177221
C  -3.22348 -0.901926 -1.529169
C  -4.335099 -0.215162 -0.988728
H  -0.57244 0.383236 1.984602
H  3.015979 -2.472241 0.292766
H  2.823247 2.454554 -0.871496
H  -2.786165 1.273931 1.698354
H  -1.107379 -1.351426 -1.334222
H  5.0247 -1.311841 -0.726906
H  4.929207 1.112548 -1.301637
H  -5.028526 1.102066 0.603514
H  -3.342903 -1.513381 -2.43061
H  -5.316801 -0.291302 -1.469325
