program: Gaussian 09
title: 000070223
version: EM64L-G09RevD.01
frameworkgroup: C1[X(C2H7NO4S)]
method: RPBEPBE
basis: SDD
operation: Freq
keyword: #p
keyword: freq=noraman
keyword: PBEPBE/SDD
title: #p freq=noraman PBEPBE/SDD
converged: YES YES NO NO
title: Mulliken charges:
elementType: S O O O O N C C H H H H H H H
charge: 1.178291 -0.425547 -0.547317 -0.455452 -0.484449 -0.555338 -0.242193 -0.373597 0.229230 0.213919 0.241852 0.233190 0.295820 0.297433 0.394160
chargesum: 0.00000
title: Mulliken charges with hydrogens summed into heavy atoms:
elementType: S O O O O N C C
charge: 1.178291 -0.425547 -0.153157 -0.455452 -0.484449 0.037915 0.200955 0.101445
polarizability: 1.71938670e+02 2.46392869e+00 6.37570174e+01 3.29165720e+00 -7.29401679e-01 6.01478051e+01
1716.lowfreq: -8.3547 -0.6532 -0.0036 -0.0027 -0.0018 6.6015 38.0399 61.4400 86.5636
frequency: 38.0084 60.7675 86.5569 125.7720 152.2375 181.1249 201.9929 266.1690 293.4153 315.4128 327.6788 386.3839 397.2287 448.1933 504.6867 565.4208 796.5573 858.8696 885.7179 954.1260 977.2662 999.5779 1093.8543 1120.7322 1157.8055 1251.2443 1320.0128 1324.1080 1344.9136 1463.6640 1480.7933 1640.8831 2976.5624 3031.2137 3048.1452 3103.2439 3457.5822 3516.9618 3651.2457
redmass: 7.0340 1.8389 5.1312 3.0405 2.3581 4.7392 6.8976 1.8610 3.7427 1.5447 3.6054 8.8341 2.4213 1.8226 11.3322 14.9366 1.0964 11.2666 8.0713 1.1895 6.7234 6.5596 1.2352 4.6290 1.2872 1.2475 1.1843 1.1904 1.1763 1.0851 1.0819 1.0978 1.0536 1.0599 1.1097 1.1083 1.0654 1.0447 1.1015
irintensity: 0.4893 4.4730 10.9834 5.8009 48.1129 20.6807 20.1079 57.8263 1.6272 28.1622 51.9141 29.1406 33.7236 514.6402 27.2787 124.9039 5.5335 129.7979 70.8935 0.5032 88.9666 86.0032 117.8122 26.3282 1.0255 0.1245 0.5418 0.6479 12.9819 23.3882 11.7575 57.7756 35.3461 41.8864 17.9779 31.3644 64.3323 78.6681 11.3223
temp: 298.150 k
press: 1.00000 atm
elementType: 16 8 8 8 8 7 6 6 1 1 1 1 1 1 1
symmnumber: 1
zpe: 273981.5 jmol-1
zpe.correction: 0.104354 hartree
zpe.thermalcorrener: 0.115522 hartree
zpe.thermalcorrenthalpy: 0.116466 hartree
zpe.thermalcorrgfe: 0.066707 hartree
zpe.sumelectzpe: -833.232984 hartree
zpe.sumelectthermal: -833.221816 hartree
zpe.sumelectthermalent: -833.220871 hartree
zpe.sumelectthermalfe: -833.270631 hartree
dipole: -6.0556 0.3069 -0.6351
dipole: 6.0965
quadrupole: -58.2175 -53.9850 -57.6614
quadrupole: 7.1474 -1.1684 -2.7746
quadrupole: -1.5962 2.6363 -1.0401 7.1474 -1.1684 -2.7746
hfenergy: -833.3373377 hartree
pointgroup: C01 [X(C2H7N1O4S1)]
dipole: -2.341637 0.2681166 -0.4449187 debye
dipolederiv: 1.4606869 0.0257766 0.0312251 -0.0235836 1.6456806 -0.0846836 -0.2070972 -0.0278634 1.4242403 0.4574143 -0.153869 0.1237884 0.1567988 -0.4833791 0.0037932 0.1261662 -0.0331486 -0.4346663 -0.6767724 -0.0888166 0.0179401 -0.7327482 -0.8714864 0.0777806 0.3297149 0.1079628 -0.5740738 -0.83664 0.0738892 -0.1206659 0.2990167 -0.4682331 0.0500793 -0.3567779 0.060617 -0.5879938 -0.5995864 0.0175479 -0.0354421 0.3672297 -0.5607443 -0.0460642 0.2995789 -0.1479522 -0.5438014 -1.5325524 0.2362853 -0.1339745 0.189515 -0.5752275 0.0128858 -0.2117281 0.0177126 -0.1986348 -0.3760102 0.1716951 -0.0821317 0.5516083 0.1888512 -0.0350385 -0.0842404 -0.0107083 0.3147445 1.2285801 -0.0590527 0.1026046 -0.7639207 0.3843328 -0.036508 0.0959453 0.010821 0.2160057 0.027166 0.0186885 0.0257552 -0.0921682 0.0204701 -0.065016 -0.0163711 -0.0870606 -0.0697185 -0.0107754 -0.0338305 0.0168029 -0.0895001 -0.039853 0.0908305 0.0253188 0.1210845 -0.057559 0.0472552 -0.0054984 0.0001058 0.094843 0.0256378 -0.0755111 0.033326 -0.1178758 -0.0563713 0.0356074 -0.0442923 0.0207461 0.0771249 -0.0215625 0.1064175 0.0101593 0.1237801 -0.0278369 0.328409 -0.0764552 0.084016 -0.1114685 0.2255933 -0.1162403 0.1708009 -0.0743183 0.1358879 0.3954862 -0.0913223 -0.0274242 -0.1336059 0.2092156 0.0809575 -0.1057785 0.0544113 0.111216 0.0517318 0.0092543 -0.0233457 0.2108588 0.3207048 0.0363175 -0.109017 0.0025378 0.3485613 unknown
polarizability: 170.5697412|-4.4181824|63.8328831|12.119938|-1.4173172|61.4408681 unknown
InChI: InChI=1S/C2H7NO4S/c3-1-2-7-8(4,5)6/h4H,1-3H2
charge 0 multiplicity 1
15 atoms
S  1.653503 -0.286463 0.162578
O  -0.058271 0.577317 0.288198
O  2.447018 1.294286 -0.303527
O  2.286305 -0.740404 1.562322
O  1.612007 -1.317318 -1.074092
N  -3.691346 0.011846 -0.342322
C  -1.222687 -0.260579 0.004686
C  -2.446335 0.724386 -0.102655
H  -1.096973 -0.804273 -0.952337
H  -1.399892 -0.980952 0.826975
H  -2.519865 1.299597 0.835057
H  -2.255155 1.438879 -0.921125
H  -3.829591 -0.415474 -1.258315
H  -4.109381 -0.495175 0.437756
H  1.684463 1.893927 -0.560198
