program: Gaussian 16
title: Def2-TZVP
version: EM64L-G16RevB.01
frameworkgroup: C2V[C2(B),SGV(F2),SGV'(Xe2)]
method: RMP2-FC
basis: Gen
operation: Freq
keyword: #N
keyword: Geom=AllCheck
keyword: Guess=TCheck
keyword: SCRF=Check
keyword: GenChk
keyword: RMP2(FC)/ChkBas
keyword: Freq
converged: YES YES YES YES
title: Mulliken charges:
elementType: F Xe Xe F B
charge: -0.164016 0.344621 0.344621 -0.164016 0.638790
chargesum: 1.00000
title: Mulliken charges with hydrogens summed into heavy atoms:
1716.lowfreq: -0.0006 -0.0006 0.0011 0.3672 1.0093 2.9229 69.8450 73.2204 176.5352
frequency: 69.8450 73.2204 176.5352 176.6611 226.0747 362.9458 461.9259 1055.8260 1647.1455
redmass: 79.7658 17.1627 19.8816 20.5652 17.8288 14.1616 14.4994 15.3487 12.3328
irintensity: 0.2100 213.4106 0.0000 15.9726 0.6126 504.3211 167.7123 301.7357 254.1578
temp: 298.150 k
press: 1.00000 atm
elementType: 9 54 54 9 5
symmnumber: 2
zpe: 25421.7 jmol-1
zpe.correction: 0.009683 hartree
zpe.thermalcorrener: 0.016447 hartree
zpe.thermalcorrenthalpy: 0.017392 hartree
zpe.thermalcorrgfe: -0.025072 hartree
zpe.sumelectzpe: -881.662162 hartree
zpe.sumelectthermal: -881.655397 hartree
zpe.sumelectthermalent: -881.654453 hartree
zpe.sumelectthermalfe: -881.696916 hartree
dipole: -0.0000 -0.0000 -0.3529
dipole: 0.3529
quadrupole: -45.1992 -65.5347 -60.8284
quadrupole: -0.0000 0.0000 -0.0000
quadrupole: 11.9882 -8.3472 -3.6409 -0.0000 0.0000 -0.0000
hfenergy: -880.0268663 hartree
pointgroup: C02V [C2(B1),SGV(F2),SGV'(Xe2)]
dipole: 0. 0. -0.086868 debye
dipolederiv: -0.6090263 0. 0. 0. -0.6459713 -0.4288315 0. -0.2472265 -0.698419 -0.2757539 0. 0.2871825 0. 0.3821847 0. 0.4058136 0. 0.1115539 -0.2757538 0. -0.2871825 0. 0.3821847 0. -0.4058136 0. 0.1115539 -0.6090262 0. 0. 0. -0.6459713 0.4288316 0. 0.2472265 -0.698419 2.7695603 0. 0. 0. 1.5275733 0. 0. 0. 2.1737302 unknown
polarizability: 78.9486751|0.|48.0201183|0.|0.|57.1804406 unknown
InChI: InChI=1/BF2Xe2/c2-1(3)4-5-1
charge 1 multiplicity 1
5 atoms
F  0.0000 1.18016619 1.79412545
Xe 1.91440829 0.0000 -0.30910096
Xe -1.91440829 0.0000 -0.30910096
F  0.0000 -1.18016619 1.79412545
B  0.0000 0.0000 1.28666039
