program: Gaussian 16
title: Def2-TZVP
version: EM64L-G16RevB.01
frameworkgroup: CS[SG(BF2Xe2)]
method: RMP2-FC
basis: Gen
operation: Freq
keyword: #N
keyword: Geom=AllCheck
keyword: Guess=TCheck
keyword: SCRF=Check
keyword: GenChk
keyword: RMP2(FC)/ChkBas
keyword: Freq
converged: YES YES YES YES
title: Mulliken charges:
elementType: F Xe Xe F B
charge: -0.131565 0.891614 0.387905 -0.536683 0.388729
chargesum: 1.00000
title: Mulliken charges with hydrogens summed into heavy atoms:
1716.lowfreq: -1.3374 -0.6296 -0.0013 -0.0012 -0.0011 1.5935 54.8679 99.5328 123.1932
frequency: 54.8679 99.5328 123.1932 187.4705 250.5909 394.2635 468.0833 543.0960 1515.1904
redmass: 35.5263 22.6300 31.7008 20.2217 18.7451 12.1369 12.6136 19.4622 12.9034
irintensity: 3.3187 8.9578 62.3050 13.1430 62.6432 5.4967 337.6662 81.7488 237.3498
temp: 298.150 k
press: 1.00000 atm
elementType: 9 54 54 9 5
symmnumber: 1
zpe: 21749.8 jmol-1
zpe.correction: 0.008284 hartree
zpe.thermalcorrener: 0.015197 hartree
zpe.thermalcorrenthalpy: 0.016141 hartree
zpe.thermalcorrgfe: -0.027290 hartree
zpe.sumelectzpe: -881.454549 hartree
zpe.sumelectthermal: -881.447636 hartree
zpe.sumelectthermalent: -881.446692 hartree
zpe.sumelectthermalfe: -881.490123 hartree
dipole: 5.2884 3.4756 0.0000
dipole: 6.3283
quadrupole: -59.5182 -65.7026 -62.2719
quadrupole: -7.8857 -0.0000 -0.0000
quadrupole: 2.9794 -3.2051 0.2257 -7.8857 -0.0000 -0.0000
hfenergy: -879.7938448 hartree
pointgroup: CS [SG(B1F2Xe2)]
dipole: -1.9773808 0.899641 0. debye
dipolederiv: -0.4101832 0.2945116 0. -0.0407479 -1.0806102 0. 0. 0. -0.032549 2.0960195 -0.5753434 0. -1.1376491 0.8245397 0. 0. 0. 0.5598404 -0.7367052 -0.2926841 0. -0.7032703 0.1875703 0. 0. 0. 0.4108944 -1.3834061 0.3752303 0. 0.6809986 -0.5028132 0. 0. 0. -0.3022569 1.434275 0.1982856 0. 1.2006687 1.5713135 0. 0. 0. 0.3640712 unknown
polarizability: 128.6173895|-7.3483838|59.6324047|0.|0.|43.7705916 unknown
InChI: InChI=1/BF2Xe2/c2-1-4-5(1)3
charge 1 multiplicity 1
5 atoms
F  -0.57338446 2.31882145 0.0000
Xe 1.78238255 0.02426197 0.0000
Xe -2.14850522 -0.32984183 0.0000
F  3.55452702 -0.91164656 0.0000
B  -0.15899845 1.13117198 0.0000
