program: Gaussian 16
title: Def2-TZVP
version: EM64L-G16RevB.01
frameworkgroup: CS[SG(BF2Xe2)]
method: RMP2-FC
basis: Gen
operation: Freq
keyword: #N
keyword: Geom=AllCheck
keyword: Guess=TCheck
keyword: SCRF=Check
keyword: GenChk
keyword: RMP2(FC)/ChkBas
keyword: Freq
converged: YES YES NO NO
title: Mulliken charges:
elementType: F Xe Xe F B
charge: -0.350093 1.162776 0.018068 -0.208460 0.377709
chargesum: 1.00000
title: Mulliken charges with hydrogens summed into heavy atoms:
1716.lowfreq: -0.6057 -0.0002 0.0003 0.0007 0.4266 1.5481 28.3559 31.8659 47.7693
frequency: 28.3559 31.8659 47.7693 53.8778 91.5096 94.0519 128.0973 653.8836 1170.1881
redmass: 23.9573 33.3712 15.2343 14.2099 20.4007 22.4805 17.7220 21.2700 12.9142
irintensity: 1.5028 4.9918 0.8984 1.5415 1.4670 0.8832 16.8595 42.1384 422.1230
temp: 298.150 k
press: 1.00000 atm
elementType: 9 54 54 9 5
symmnumber: 1
zpe: 13754.7 jmol-1
zpe.correction: 0.005239 hartree
zpe.thermalcorrener: 0.013823 hartree
zpe.thermalcorrenthalpy: 0.014767 hartree
zpe.thermalcorrgfe: -0.035838 hartree
zpe.sumelectzpe: -881.369180 hartree
zpe.sumelectthermal: -881.360596 hartree
zpe.sumelectthermalent: -881.359651 hartree
zpe.sumelectthermalfe: -881.410257 hartree
dipole: 1.5187 6.1872 -0.0000
dipole: 6.3709
quadrupole: -62.4883 -49.7232 -63.9596
quadrupole: 3.5287 0.0000 -0.0000
quadrupole: -3.7646 9.0005 -5.2359 3.5287 0.0000 -0.0000
hfenergy: -879.7443893 hartree
pointgroup: CS [SG(B1F2Xe2)]
dipole: -0.5317382 2.4832291 0. debye
dipolederiv: -1.3345264 -0.9483115 0. -1.0217248 -0.6178432 0. 0. 0. 0.1124456 1.6768126 0.4842586 0. 0.4175575 1.5027505 0. 0. 0. 0.9161429 0.0251294 0.0381533 0. 0.0389855 -0.1084462 0. 0. 0. 0.0612767 -0.4336567 -0.2680509 0. -0.2249856 -0.3213756 0. 0. 0. -0.0725393 1.066241 0.6939504 0. 0.7901674 0.5449145 0. 0. 0. -0.0173259 unknown
polarizability: 81.5815783|13.6411891|74.5550001|0.|0.|51.7171689 unknown
InChI: InChI=1/BF2Xe2/c1-3-5(2)4
charge 1 multiplicity 1
5 atoms
F  -2.27294137 0.37403449 0.0000
Xe 0.00056645 1.75535324 0.0000
Xe 0.43308733 -2.25772577 0.0000
F  1.51611423 2.85333598 0.0000
B  -3.31354563 -0.42929195 0.0000
