program: Gaussian 16
title: Def2-TZVP
version: EM64L-G16RevB.01
frameworkgroup: CS[SG(AlF2Xe)]
method: UMP2-FC
basis: Gen
operation: Freq
keyword: #N
keyword: Geom=AllCheck
keyword: Guess=TCheck
keyword: SCRF=Check
keyword: GenChk
keyword: UMP2(FC)/ChkBas
keyword: Freq
converged: YES YES NO NO
elementType: Al
elementType: F
1716.lowfreq: -7.3768 -2.1645 -0.0011 -0.0007 0.0013 2.4397 33.4268 105.0147 214.9681
frequency: 33.4163 105.0134 214.9681 285.4615 618.7932 861.0316
redmass: 23.4641 21.7255 25.0845 19.9460 21.6623 21.6850
irintensity: 5.2786 17.6523 5.2566 74.6923 370.2115 94.1026
temp: 298.150 k
press: 1.00000 atm
elementType: 13 9 54 9
symmnumber: 1
zpe: 12672.5 jmol-1
zpe.correction: 0.004827 hartree
zpe.thermalcorrener: 0.010443 hartree
zpe.thermalcorrenthalpy: 0.011387 hartree
zpe.thermalcorrgfe: -0.028973 hartree
zpe.sumelectzpe: -769.975749 hartree
zpe.sumelectthermal: -769.970132 hartree
zpe.sumelectthermalent: -769.969188 hartree
zpe.sumelectthermalfe: -770.009548 hartree
dipole: -1.5911 -0.3812 0.0000
dipole: 1.6361
quadrupole: -47.7561 -19.1739 -40.6578
quadrupole: 6.1530 0.0000 0.0000
quadrupole: -11.8935 16.6887 -4.7952 6.1530 0.0000 0.0000
hfenergy: -768.9240061 hartree
pointgroup: CS [SG(Al1F2Xe1)]
dipole: 0.2534179 -0.6239982 0. debye
dipolederiv: 2.1416297 -0.1075265 0. 0.4245807 1.341085 0. 0. 0. 0.6697637 -0.537294 0.1820389 0. -0.0920651 -0.7841006 0. 0. 0. -0.2429585 1.5559875 -0.2182844 0. -0.3110791 0.8547796 0. 0. 0. 0.7418995 -2.1603231 0.143772 0. -0.0214365 -0.411764 0. 0. 0. -0.1687046 unknown
polarizability: 62.8418127|-4.499982|41.7524187|0.|0.|45.2218126 unknown
InChI: InChI=1/Al.FXe.FH/c;1-2;/h;;1H/q+1;;/p-1/rAlF2Xe/c2-1-3-4
charge 1 multiplicity 3
4 atoms
Al 2.66838112 -0.35164228 0.0000
F  2.38050209 1.26529786 0.0000
Xe -1.10497188 -0.00588854 0.0000
F  1.08076526 -1.06904826 0.0000
