program: Gaussian 16
title: Def2-TZVP
version: EM64L-G16RevB.01
frameworkgroup: CS[SG(AlF2Xe2)]
method: RMP2-FC
basis: Gen
operation: Freq
keyword: #NGeom=AllCheck
keyword: Guess=TCheck
keyword: SCRF=Check
keyword: GenChk
keyword: RMP2(FC)/ChkBas
keyword: Freq
converged: YES YES YES YES
title: Mulliken charges:
elementType: F Xe Xe F Al
charge: -0.518794 1.127734 0.036619 -0.302937 0.657379
chargesum: 1.00000
title: Mulliken charges with hydrogens summed into heavy atoms:
1716.lowfreq: -0.4549 -0.3302 -0.2583 0.0008 0.0013 0.0015 9.8779 42.3950 62.2245
frequency: 9.8779 42.3950 62.2245 76.1524 174.4302 176.9794 225.0921 482.0688 617.8539
redmass: 54.5837 34.4121 21.4702 22.2989 23.0610 23.0136 27.5957 21.1327 21.2621
irintensity: 0.8621 10.2523 0.9105 3.8317 7.1042 11.4648 12.4036 509.4666 90.1568
temp: 298.150 k
press: 1.00000 atm
elementType: 9 54 54 9 13
symmnumber: 1
zpe: 11167.6 jmol-1
zpe.correction: 0.004254 hartree
zpe.thermalcorrener: 0.012560 hartree
zpe.thermalcorrenthalpy: 0.013504 hartree
zpe.thermalcorrgfe: -0.036338 hartree
zpe.sumelectzpe: -1098.719424 hartree
zpe.sumelectthermal: -1098.711118 hartree
zpe.sumelectthermalent: -1098.710174 hartree
zpe.sumelectthermalfe: -1098.760015 hartree
dipole: 1.1318 5.5706 0.0000
dipole: 5.6844
quadrupole: -56.4046 -56.6202 -68.9966
quadrupole: -0.0384 0.0000 0.0000
quadrupole: 4.2692 4.0536 -8.3228 -0.0384 0.0000 0.0000
hfenergy: -1097.099325 hartree
pointgroup: CS [SG(Al1F2Xe2)]
dipole: 0.9629001 2.0519714 0. debye
dipolederiv: -1.598845 1.1260254 0. 1.1956034 -1.2569825 0. 0. 0. -0.163803 2.1110836 -1.0112287 0. -1.2223851 1.9267255 0. 0. 0. 0.8396996 -0.0069658 -0.0663952 0. -0.1088955 -0.1272313 0. 0. 0. 0.0690855 -0.7677714 0.5132344 0. 0.6145412 -0.7083089 0. 0. 0. -0.1649134 1.2624987 -0.5616359 0. -0.4788638 1.1657972 0. 0. 0. 0.4199312 unknown
polarizability: 109.7377661|-25.2893902|109.9442802|0.|0.|66.5370592 unknown
InChI: InChI=1/Al.F2Xe.Xe/c;1-3-2;/rAlF2Xe.Xe/c1-3-4-2;
charge 1 multiplicity 1
5 atoms
F  0.63258961 1.56076872 0.0000
Xe 2.19996435 -0.06949751 0.0000
Xe -2.28738337 -0.84161287 0.0000
F  3.51716555 -1.43596263 0.0000
Al -0.80073243 2.68172262 0.0000
