program: Gaussian 16
title: Def2-TZVP
version: EM64L-G16RevB.01
frameworkgroup: C1[X(AlF2Xe2)]
method: UMP2-FC
basis: Gen
operation: Freq
keyword: #NGeom=AllCheck
keyword: Guess=TCheck
keyword: SCRF=Check
keyword: GenChk
keyword: UMP2(FC)/ChkBas
keyword: Freq
converged: YES YES YES YES
elementType: Al
elementType: F
1716.lowfreq: -0.0017 -0.0015 -0.0008 0.4812 0.8320 1.2383 27.3576 31.3660 58.3816
frequency: 27.3574 31.3660 58.3816 73.7473 102.3902 133.4681 268.8736 757.0378 843.6694
redmass: 20.7736 40.3549 21.5859 24.8985 21.9542 130.9343 20.6249 21.1079 22.1431
irintensity: 0.1759 0.4342 3.5867 2.8285 14.4023 0.0615 53.8068 133.9573 110.9037
temp: 298.150 k
press: 1.00000 atm
elementType: 13 54 54 9 9
symmnumber: 1
zpe: 13734.9 jmol-1
zpe.correction: 0.005231 hartree
zpe.thermalcorrener: 0.013447 hartree
zpe.thermalcorrenthalpy: 0.014391 hartree
zpe.thermalcorrgfe: -0.035895 hartree
zpe.sumelectzpe: -1098.822800 hartree
zpe.sumelectthermal: -1098.814584 hartree
zpe.sumelectthermalent: -1098.813640 hartree
zpe.sumelectthermalfe: -1098.863926 hartree
dipole: 0.4325 -0.9291 -0.0006
dipole: 1.0248
quadrupole: -50.9890 -56.3609 -66.6962
quadrupole: 5.4078 0.0020 -0.0005
quadrupole: 7.0263 1.6545 -8.6808 5.4078 0.0020 -0.0005
hfenergy: -1097.2316485 hartree
pointgroup: C01 [X(Al1F2Xe2)]
dipole: 0.228508 -0.3129873 -0.0002253 debye
dipolederiv: 1.5658562 0.123173 0.0000802 0.1631235 1.4276254 0.0002379 0.0000973 0.0002393 0.5260167 0.5387706 0.0549038 -0.0000101 0.0920366 0.5221183 -0.0000067 -0.0000182 -0.0000022 0.4440984 0.5579732 0.0574673 0.0000001 0.0301639 0.4948584 0.0000005 0.0000026 0.0000004 0.4551526 -0.5860997 -0.0828266 -0.0000197 -0.0212553 -0.9103421 -0.0001607 0.0000165 -0.0001732 -0.2199432 -1.0765003 -0.1527174 -0.0000505 -0.2640687 -0.53426 -0.0000711 -0.0000982 -0.0000643 -0.2053245 unknown
polarizability: 92.5195445|-23.0106227|83.8420432|-0.0003486|-0.0025999|63.3485783 unknown
InChI: InChI=1/Al.2FH.Xe2/c;;;1-2/h;2*1H;/q+2;;;/p-2/rAlF2.Xe2/c2-1-3;1-2
charge 1 multiplicity 3
5 atoms
Al -2.82575 -1.859165 -0.000125
Xe -0.411787 1.46057 -0.000027
Xe 1.830174 -0.644941 0.000019
F  -3.274359 -0.260956 0.000247
F  -1.154324 -1.947361 -0.00002
