program: Gaussian 16
title: Def2-TZVP
version: EM64L-G16RevB.01
frameworkgroup: C2V[C2(GaXeXe),SGV(F2)]
method: RMP2-FC
basis: Gen
operation: Freq
keyword: #NGeom=AllCheck
keyword: Guess=TCheck
keyword: SCRF=Check
keyword: GenChk
keyword: RMP2(FC)/ChkBas
keyword: Freq
converged: YES YES NO NO
title: Mulliken charges:
elementType: Xe F F Ga Xe
charge: 0.331345 -0.344965 -0.344965 1.336956 0.021628
chargesum: 1.00000
title: Mulliken charges with hydrogens summed into heavy atoms:
1716.lowfreq: -2.0160 -0.0086 -0.0053 0.0046 0.4493 0.6017 10.8796 11.1860 34.2703
frequency: 10.8795 11.1860 34.2703 100.0950 153.7408 163.3713 189.8794 717.7358 860.9165
redmass: 51.2208 66.3491 91.4182 23.3722 24.4598 27.9473 54.4657 19.5032 25.0364
irintensity: 0.2580 0.2510 4.4978 1.9142 20.8832 38.2986 103.5423 43.7449 75.9909
temp: 298.150 k
press: 1.00000 atm
elementType: 54 9 9 31 54
symmnumber: 2
zpe: 13410.6 jmol-1
zpe.correction: 0.005108 hartree
zpe.thermalcorrener: 0.013384 hartree
zpe.thermalcorrenthalpy: 0.014328 hartree
zpe.thermalcorrgfe: -0.036331 hartree
zpe.sumelectzpe: -2780.340089 hartree
zpe.sumelectthermal: -2780.331813 hartree
zpe.sumelectthermalent: -2780.330868 hartree
zpe.sumelectthermalfe: -2780.381528 hartree
dipole: 0.0000 0.0000 -6.4098
dipole: 6.4098
quadrupole: -70.0705 -81.2386 -46.0873
quadrupole: -0.0000 -0.0000 -0.0000
quadrupole: -4.2717 -15.4398 19.7115 -0.0000 -0.0000 -0.0000
hfenergy: -2778.5849906 hartree
pointgroup: C02V [C2(Ga1Xe1Xe1),SGV(F2)]
dipole: 0. 0. 2.5980652 debye
dipolederiv: 0.3664618 0. 0. 0. 0.3879246 0. 0. 0. -0.1479782 -0.3860249 0. 0. 0. -0.5971039 -0.2745617 0. -0.0819025 -0.7344148 -0.3860249 0. 0. 0. -0.5971038 0.2745616 0. 0.0819025 -0.7344148 1.3471454 0. 0. 0. 1.7465886 0.0000002 0. 0. 2.8110657 0.0584427 0. 0. 0. 0.0596946 0. 0. 0. -0.1942579 unknown
polarizability: 49.0399133|0.|57.8792673|0.|0.|90.7829697 unknown
InChI: InChI=1/2FH.Ga.Xe2/c;;;1-2/h2*1H;;/q;;+2;/p-2/rF2GaXe2/c1-3(2)5-4
charge 1 multiplicity 1
5 atoms
Xe 0.0000 0.0000 0.56950057
F  0.0000 1.62270869 3.6781233
F  0.0000 -1.62270869 3.6781233
Ga 0.0000 0.0000 3.20158235
Xe 0.0000 0.0000 -3.30139244
