program: Gaussian 16
title: Def2-TZVP
version: EM64L-G16RevB.01
frameworkgroup: CS[SG(F2GaXe2)]
method: RMP2-FC
basis: Gen
operation: Freq
keyword: #NGeom=AllCheck
keyword: Guess=TCheck
keyword: SCRF=Check
keyword: GenChk
keyword: RMP2(FC)/ChkBas
keyword: Freq
converged: YES YES YES YES
title: Mulliken charges:
elementType: F Xe Xe F Ga
charge: -0.580396 1.113528 0.058436 -0.340022 0.748455
chargesum: 1.00000
title: Mulliken charges with hydrogens summed into heavy atoms:
1716.lowfreq: -1.3491 -0.7962 -0.0033 0.0045 0.0064 0.3277 9.2072 42.7808 53.9790
frequency: 9.2070 42.7808 53.9790 67.4894 165.4930 189.8210 192.4746 406.1359 609.9887
redmass: 63.7280 53.6884 21.5594 25.5219 66.7091 23.1607 23.1458 20.3850 21.2436
irintensity: 0.5291 6.9890 0.5391 4.1925 5.1866 10.3986 13.1798 555.9573 102.0456
temp: 298.150 k
press: 1.00000 atm
elementType: 9 54 54 9 31
symmnumber: 1
zpe: 10391.8 jmol-1
zpe.correction: 0.003958 hartree
zpe.thermalcorrener: 0.012414 hartree
zpe.thermalcorrenthalpy: 0.013358 hartree
zpe.thermalcorrgfe: -0.037621 hartree
zpe.sumelectzpe: -2780.197913 hartree
zpe.sumelectthermal: -2780.189458 hartree
zpe.sumelectthermalent: -2780.188514 hartree
zpe.sumelectthermalfe: -2780.239493 hartree
dipole: -1.1121 4.2389 0.0000
dipole: 4.3824
quadrupole: -58.0542 -61.8018 -72.2519
quadrupole: 1.3863 0.0000 0.0000
quadrupole: 5.9818 2.2341 -8.2159 1.3863 0.0000 0.0000
hfenergy: -2778.4336125 hartree
pointgroup: CS [SG(F2Ga1Xe2)]
dipole: 0.1140046 1.7488598 0. debye
dipolederiv: -2.6567799 0.7991305 0. 0.9329005 -0.6457412 0. 0. 0. -0.2689935 2.9612256 -0.7281326 0. -0.9106389 1.1699761 0. 0. 0. 0.8363805 0.0508813 -0.0727228 0. -0.1351759 -0.2558639 0. 0. 0. 0.0916165 -1.113893 0.3302417 0. 0.4030352 -0.3519613 0. 0. 0. -0.2026071 1.758566 -0.3285169 0. -0.2901209 1.0835903 0. 0. 0. 0.5436035 unknown
polarizability: 118.1006947|-14.2275518|86.3316288|0.|0.|58.9813329 unknown
InChI: InChI=1/F2Xe.Ga.Xe/c1-3-2;;/rF2GaXe2/c1-5-2-3-4
charge 1 multiplicity 1
5 atoms
F  0.13187552 1.49810383 0.0000
Xe 2.12363325 0.60958882 0.0000
Xe -2.65226582 -1.20018319 0.0000
F  3.86629065 -0.16880992 0.0000
Ga -1.75259461 2.21698046 0.0000
