program: Gaussian 16
title: Def2-TZVP
version: EM64L-G16RevB.01
frameworkgroup: C2V[C2(XeTl),SGV(F2)]
method: RMP2-FC
basis: Gen
operation: Freq
keyword: #NGeom=AllCheck
keyword: Guess=TCheck
keyword: SCRF=Check
keyword: GenChk
keyword: RMP2(FC)/ChkBas
keyword: Freq
converged: YES YES YES YES
title: Mulliken charges:
elementType: F F Xe Tl
charge: -0.390359 -0.390359 0.200646 1.580072
chargesum: 1.00000
title: Mulliken charges with hydrogens summed into heavy atoms:
1716.lowfreq: -4.5063 -1.6399 -0.0004 -0.0002 0.0008 0.5562 63.6154 91.1991 165.2448
frequency: 63.6153 91.1991 165.2448 165.9690 615.9358 719.4339
redmass: 21.8455 133.0065 22.4276 21.3123 19.0034 22.0988
irintensity: 0.0480 11.5937 11.8004 30.5806 10.3967 44.5202
temp: 298.150 k
press: 1.00000 atm
elementType: 9 9 54 81
symmnumber: 2
zpe: 10894.4 jmol-1
zpe.correction: 0.004149 hartree
zpe.thermalcorrener: 0.010030 hartree
zpe.thermalcorrenthalpy: 0.010974 hartree
zpe.thermalcorrgfe: -0.029820 hartree
zpe.sumelectzpe: -699.906033 hartree
zpe.sumelectthermal: -699.900153 hartree
zpe.sumelectthermalent: -699.899209 hartree
zpe.sumelectthermalfe: -699.940003 hartree
dipole: 0.0000 -0.0000 1.0001
dipole: 1.0001
quadrupole: -53.1978 -66.5873 -40.7083
quadrupole: -0.0000 0.0000 -0.0000
quadrupole: 0.3000 -13.0895 12.7895 -0.0000 0.0000 -0.0000
hfenergy: -698.4495884 hartree
pointgroup: C02V [C2(Xe1Tl1),SGV(F2)]
dipole: 0. 0. -0.3799518 debye
dipolederiv: -0.5476656 0. -0.2990274 0. -0.2528821 0. -0.0343287 0. -0.4287566 -0.5476656 0. 0.2990274 0. -0.2528821 0. 0.0343287 0. -0.4287566 0.2758628 0. 0. 0. 0.2592819 0. 0. 0. -0.4607015 1.8194685 0. 0. 0. 1.2464822 0. 0. 0. 2.3182147 unknown
polarizability: 57.2825774|0.|35.6658711|0.|0.|63.7594597 unknown
InChI: InChI=1/2FH.Tl.Xe/h2*1H;;/q;;+2;/p-2/rF2TlXe/c1-3(2)4
charge 1 multiplicity 1
4 atoms
F  -1.89216307 -0.0000 -1.20300572
F  1.89216308 0.0000 -1.20300571
Xe -0.0000 0.0000 1.97539686
Tl 0.0000 0.0000 -1.06825611
