program: Gaussian 16
title: Def2-TZVP
version: EM64L-G16RevB.01
frameworkgroup: CS[SG(F2TlXe)]
method: RMP2-FC
basis: Gen
operation: Freq
keyword: #NGeom=AllCheck
keyword: Guess=TCheck
keyword: SCRF=Check
keyword: GenChk
keyword: RMP2(FC)/ChkBas
keyword: Freq
converged: YES YES YES YES
title: Mulliken charges:
elementType: F F Xe Tl
charge: -0.009921 0.027526 0.092643 0.889752
chargesum: 1.00000
title: Mulliken charges with hydrogens summed into heavy atoms:
1716.lowfreq: -0.4836 -0.4576 -0.4179 -0.0006 -0.0003 0.0006 14.3482 15.3500 41.5888
frequency: 14.3478 15.3500 41.5888 54.2119 69.7065 992.7960
redmass: 19.2512 25.7288 19.9105 114.5491 22.1639 18.9984
irintensity: 0.0008 0.3710 0.0890 6.1988 2.2218 0.1045
temp: 298.150 k
press: 1.00000 atm
elementType: 9 9 54 81
symmnumber: 1
zpe: 7105.8 jmol-1
zpe.correction: 0.002706 hartree
zpe.thermalcorrener: 0.009871 hartree
zpe.thermalcorrenthalpy: 0.010816 hartree
zpe.thermalcorrgfe: -0.038381 hartree
zpe.sumelectzpe: -699.863320 hartree
zpe.sumelectthermal: -699.856155 hartree
zpe.sumelectthermalent: -699.855211 hartree
zpe.sumelectthermalfe: -699.904408 hartree
dipole: -0.1422 3.9852 0.0000
dipole: 3.9877
quadrupole: -53.0188 -43.5721 -55.9253
quadrupole: 2.5160 -0.0000 0.0000
quadrupole: -2.1800 7.2667 -5.0866 2.5160 -0.0000 0.0000
hfenergy: -698.3956301 hartree
pointgroup: CS [SG(F2Tl1Xe1)]
dipole: 1.5051171 -0.5182026 0. debye
dipolederiv: 0.0159681 -0.0006072 0. -0.0146011 -0.1017308 0. 0. 0. 0.0049641 0.0184532 0.0386649 0. 0.024093 -0.0058653 0. 0. 0. 0.0263821 -0.3575729 0.0026506 0. 0.0115584 0.1241972 0. 0. 0. 0.1335024 1.3231516 -0.0407082 0. -0.0210503 0.9833989 0. 0. 0. 0.8351514 unknown
polarizability: 69.948837|2.0147084|45.0999426|0.|0.|40.5372339 unknown
InChI: InChI=1/F2.Tl.Xe/c1-2;;/rF2.TlXe/c2*1-2
charge 1 multiplicity 1
4 atoms
F  0.21417791 2.61676528 0.0000
F  1.5684903 2.98906542 0.0000
Xe -2.23856175 -0.25806503 0.0000
Tl 1.2025468 -0.30399542 0.0000
