program: Gaussian 16
title: Def2-TZVP
version: EM64L-G16RevB.01
frameworkgroup: C*V[C*(FXeFXeTl)]
method: RMP2-FC
basis: Gen
operation: Freq
keyword: #NGeom=AllCheck
keyword: Guess=TCheck
keyword: SCRF=Check
keyword: GenChk
keyword: RMP2(FC)/ChkBas
keyword: Freq
converged: YES YES YES YES
title: Mulliken charges:
elementType: Tl Xe F Xe F
charge: 0.870442 0.118349 -0.567875 1.048801 -0.469716
chargesum: 1.00000
title: Mulliken charges with hydrogens summed into heavy atoms:
1716.lowfreq: 0.0004 0.0006 0.0007 0.5436 0.5436 6.6512 6.6512 27.7944 27.7944
frequency: 6.6498 6.6498 27.7942 27.7942 33.1528 77.9716 216.0536 216.0536 508.9079 571.9193
redmass: 101.3496 101.3496 20.0896 20.0896 78.5357 133.4237 23.4129 23.4129 19.5922 22.6356
irintensity: 0.3156 0.3156 0.0536 0.0536 5.7080 5.2114 16.2821 16.2821 97.5564 269.2355
temp: 298.150 k
press: 1.00000 atm
elementType: 81 54 9 54 9
symmnumber: 1
zpe: 10126.1 jmol-1
zpe.correction: 0.003857 hartree
zpe.thermalcorrener: 0.012954 hartree
zpe.thermalcorrenthalpy: 0.013898 hartree
zpe.thermalcorrgfe: -0.039960 hartree
zpe.sumelectzpe: -1028.719704 hartree
zpe.sumelectthermal: -1028.710607 hartree
zpe.sumelectthermalent: -1028.709663 hartree
zpe.sumelectthermalfe: -1028.763521 hartree
dipole: 0.0000 0.0000 13.6042
dipole: 13.6042
quadrupole: -80.8136 -80.8136 -25.0022
quadrupole: 0.0000 0.0000 0.0000
quadrupole: -18.6038 -18.6038 37.2076 0.0000 0.0000 0.0000
hfenergy: -1026.7062361 hartree
pointgroup: C*V [C*(F1Xe1F1Xe1Tl1)]
dipole: 0. 0. -5.434896 debye
dipolederiv: 0.8257145 0. 0. 0. 0.8257145 0. 0. 0. 1.5232175 0.129372 0. 0. 0. 0.129372 0. 0. 0. -0.2952402 -0.368996 0. 0. 0. -0.368996 0. 0. 0. -1.9129722 0.7359737 0. 0. 0. 0.7359737 0. 0. 0. 3.1331958 -0.3220642 0. 0. 0. -0.3220642 0. 0. 0. -1.4482009 unknown
polarizability: 56.3138726|0.|56.3138726|0.|0.|136.2245306 unknown
InChI: InChI=1/F2Xe.Tl.Xe/c1-3-2;;/rF2Xe.TlXe/c1-3-2;1-2
charge 1 multiplicity 1
5 atoms
Tl 0.0000 0.0000 -3.67750459
Xe 0.0000 0.0000 -0.35670462
F  0.0000 0.0000 2.73684602
Xe 0.0000 0.0000 4.75304999
F  0.0000 0.0000 6.71522306
