program: Gaussian 16
title: displacement calc 0.5
version: ES64L-G16RevC.01
frameworkgroup: C1[X(C26H47N4NaS)]
method: RwB97XD
basis: Gen
operation: Freq
keyword: #P
keyword: Geom=AllCheck
keyword: Guess=TCheck
keyword: SCRF=Check
keyword: GenChk
keyword: RwB97XD/ChkBas
keyword: Freq
converged: YES YES NO NO
title: Mulliken charges:
elementType: N N N C H H H C C H H C H H C H H H C H H C H H C H H H Na H H H C H H H C C C C H H H H H H H H C C C C C H H H H H H H H H H N C C C C C C C C H H H H H H S
charge: -0.611013 -0.631201 -0.640502 -0.203885 0.136719 0.147868 0.174111 -0.060565 -0.060134 0.136569 0.120960 -0.070041 0.134266 0.167576 -0.196107 0.139596 0.140674 0.120272 -0.046378 0.134568 0.102277 -0.184282 0.167589 0.160688 -0.201268 0.121555 0.137386 0.150740 0.481653 0.132187 0.142351 0.121985 -0.184587 0.130225 0.136194 0.163032 0.157179 0.144451 -0.367346 -0.350265 0.100696 0.100266 0.124413 0.119356 0.146434 0.158388 0.111399 0.091877 -0.203601 -0.342202 -0.211091 -0.345152 -0.229410 0.104965 0.110691 0.160144 0.101838 0.107170 0.102247 0.108644 0.168746 0.112424 0.111070 -0.736474 -0.215133 0.111888 -0.154521 -0.133910 -0.131562 -0.119835 -0.364647 -0.200877 0.103626 0.104518 0.105226 0.123075 0.359963 0.078183 0.066067
chargesum: -0.00000
title: Mulliken charges with hydrogens summed into heavy atoms:
elementType: N N N C C C C C C C C Na C C C C C C C C C C N C C C C C C C C S
charge: -0.611013 -0.631201 -0.640502 0.254813 0.213973 0.197395 0.231801 0.204436 0.190467 0.265980 0.208413 0.481653 0.244863 0.157179 0.144451 0.014901 0.019356 0.002060 0.030472 -0.003655 0.034485 -0.005916 -0.376511 -0.215133 0.111888 -0.050896 -0.029392 -0.026335 0.003240 -0.364647 -0.122694 0.066067
chargesum: 0.00000
polarizability: 4.05424829e+02 -4.39534733e+00 3.00497301e+02 7.50281767e+00 -1.97218712e+01 3.09454223e+02
1716.lowfreq: 0.0001 0.0006 0.0010 0.2522 5.0527 5.7512 20.7027 29.4766 36.6806
frequency: 20.6552 29.4624 36.6459 43.6080 47.6858 50.3181 59.5123 67.2535 69.4242 76.5334 86.1053 90.9371 99.0833 101.8492 109.1584 130.9257 144.5664 155.2779 156.5845 173.2763 186.6301 191.0866 201.9117 205.8000 214.6544 219.1183 238.1127 251.4136 257.2418 260.5692 267.1410 270.6085 276.2413 280.7582 295.0802 304.5830 307.0934 319.6352 322.8881 336.6570 349.4351 359.1238 369.6618 376.3940 380.7209 393.4039 418.8440 420.0158 428.3651 435.0398 441.6038 459.3765 461.2993 478.6981 483.1577 493.6619 495.2074 501.7096 504.4331 542.9900 567.4683 576.1887 589.2142 592.0354 596.5559 649.2913 721.4838 727.6478 755.1799 768.2282 776.7991 782.6205 788.3208 809.4959 822.5452 840.8355 878.3116 880.1592 880.9905 891.4972 902.1370 922.8293 940.0973 941.3222 944.8161 955.9236 973.1685 973.7886 980.5753 993.3733 994.3743 1016.6682 1023.4903 1026.4112 1055.8491 1060.4481 1065.3198 1070.0564 1073.0480 1075.2265 1079.1095 1082.9306 1085.7522 1090.4967 1105.4913 1115.2100 1121.3709 1131.7424 1133.4317 1147.0969 1164.2187 1165.5377 1168.5133 1185.7841 1190.4023 1193.3256 1203.5244 1219.6191 1219.7638 1228.2259 1234.9524 1251.1884 1268.2374 1272.3294 1273.4634 1286.9239 1308.3487 1308.8177 1311.1247 1312.9478 1331.7310 1332.6853 1342.0061 1343.0184 1351.4920 1360.7831 1379.1433 1379.5713 1398.9910 1401.1469 1403.1908 1406.8225 1413.1563 1413.2956 1430.5436 1439.4946 1440.6356 1444.9252 1459.3208 1462.4244 1463.2722 1476.3283 1483.0954 1486.1688 1486.5533 1488.8770 1491.4179 1492.6933 1493.7139 1497.2540 1500.0927 1503.0908 1504.4738 1506.5562 1506.6721 1507.6351 1509.6794 1511.5991 1512.1825 1513.9837 1516.6660 1519.9617 1520.8054 1521.9961 1524.6420 1525.3626 1530.7904 1532.4900 1533.1988 1536.8587 1545.3482 1623.8913 1644.4430 1678.0227 2963.6659 2966.9354 2971.2568 2974.7296 2976.4250 2980.5632 2980.8453 2984.6823 3002.9943 3045.4323 3047.8109 3051.7809 3057.7778 3063.7124 3066.4549 3071.2660 3102.7434 3103.5378 3104.5084 3105.2343 3105.2799 3113.8627 3117.5058 3118.0435 3121.3913 3124.7868 3127.8226 3133.0673 3134.9594 3137.2184 3138.0016 3142.0923 3142.6923 3145.9816 3152.3238 3158.4609 3165.4871 3167.4486 3168.3242 3177.1816 3183.5645 3186.2938 3194.0131 3202.5442 3207.7935 3214.1106 3227.8777
redmass: 4.9077 4.1400 4.5194 3.7818 3.4396 4.4716 4.4488 4.3542 3.8033 3.7979 4.6466 3.8596 4.1793 3.1450 3.7210 2.6845 2.9833 2.6997 2.8887 2.8041 5.8404 7.9842 1.6617 1.8455 3.9197 2.4546 1.5431 1.3293 2.8987 1.2545 1.2792 1.6586 1.1046 1.4178 2.0315 1.8931 1.6097 1.5733 1.8727 2.2106 4.4404 1.3961 2.0113 2.3562 2.2917 2.6215 1.9386 2.2406 1.9645 3.1460 1.9049 2.0724 2.0027 2.1456 2.1760 2.9971 2.9303 7.0426 6.3216 8.0414 3.1449 2.3981 3.5709 2.8409 2.1720 8.6283 2.8303 6.5818 2.3798 1.5127 8.2514 2.8137 2.4572 2.6897 2.9828 1.2906 1.7981 1.6857 1.4553 4.9444 2.7815 1.9989 1.7554 1.7411 1.5291 1.3642 2.1940 1.6469 2.1790 1.2650 1.5678 1.3811 2.1307 1.2951 1.8774 2.1906 2.1780 2.0319 1.7089 1.5309 1.5761 1.5303 1.6225 4.5912 2.0204 1.3858 1.8887 1.3080 1.2953 1.2477 1.4861 1.8481 1.3651 1.8514 1.1838 1.4501 1.5928 1.2623 1.8031 2.3045 2.1056 2.8047 1.8226 2.4312 2.5785 2.2133 2.0802 2.1803 1.9890 2.3592 1.4863 1.4440 1.3831 1.7729 1.5184 1.4857 3.2582 1.8315 1.4472 1.6792 1.4066 1.3213 1.3543 1.3660 1.2433 1.2523 1.4455 1.4173 1.1736 2.9686 1.1772 1.1486 1.1302 1.0879 1.1063 1.0568 1.0533 1.0957 1.0635 1.0654 1.1072 1.0623 1.0708 1.8679 1.1071 1.2017 1.0717 1.0887 1.0699 1.0774 1.1029 1.0783 1.0623 1.0595 1.0584 1.0576 1.0741 1.0857 1.1002 2.6811 1.1198 1.2131 6.1047 6.1987 1.0717 1.0688 1.0589 1.0566 1.0603 1.0579 1.0582 1.0683 1.0744 1.0359 1.0421 1.0550 1.0592 1.0398 1.0445 1.0609 1.0864 1.0986 1.0810 1.0980 1.0898 1.0789 1.0797 1.1020 1.0823 1.0906 1.1015 1.1013 1.1014 1.0992 1.0936 1.1020 1.0782 1.1005 1.1029 1.0891 1.0998 1.1015 1.1036 1.1012 1.0972 1.1037 1.0858 1.0878 1.0825 1.0941 1.0983
irintensity: 0.1237 1.1585 1.1276 0.3773 1.8431 0.2330 1.0297 1.7526 0.9970 0.3457 6.3054 0.7171 1.3925 0.5738 2.2563 1.4171 1.0436 1.5281 3.6407 1.9399 8.5342 25.4710 0.3464 2.0046 4.0160 1.2471 5.1387 0.5439 17.2206 1.0740 1.8819 3.0431 0.2743 0.5715 1.3561 1.2771 0.1694 1.0168 0.3135 0.2674 0.3174 0.1230 8.1159 4.7301 0.1304 2.2482 1.0476 0.5120 5.2808 0.6114 6.3849 0.3038 2.0801 0.3350 5.5338 0.1175 0.2556 4.8089 11.9587 1.9168 7.4623 6.6975 6.5516 6.5072 0.0924 2.9483 2.9006 3.4844 15.6125 21.3329 47.8712 0.2071 8.4930 16.6809 25.4769 24.5929 6.6422 3.9758 5.4369 4.5768 5.2582 4.9472 0.1835 0.3551 0.3577 2.3163 17.6410 7.0256 19.2805 0.0100 5.5942 7.0213 22.9422 0.7833 5.8741 7.6402 12.5797 3.7727 15.4877 18.0339 7.2326 9.6219 4.4731 14.1345 17.6885 0.7897 6.4516 1.3808 1.0784 117.0127 7.4155 31.8273 2.5231 25.0803 3.3836 21.8845 16.8317 3.1826 12.0749 11.9009 0.5085 12.5063 0.2702 8.7576 4.4977 0.3323 9.0216 16.9407 9.9064 6.5081 8.2049 3.7079 7.3606 2.8129 24.4351 23.1874 5.3062 4.2596 0.1379 4.6013 15.4508 7.0049 11.4233 13.9659 18.8233 13.2041 2.1327 3.0263 1.8179 19.4815 2.0192 2.2954 2.1880 10.0783 2.1773 3.0398 16.4756 5.6022 1.4380 1.0494 1.5622 3.9277 9.2665 11.7662 7.9349 12.2665 23.7391 11.4148 26.2822 17.7884 10.4446 8.6208 0.4532 4.9165 8.6102 21.3099 14.9304 17.9977 5.6419 0.7312 3.6278 5.3366 1.5610 3.1295 34.2918 0.9067 38.9329 28.4276 54.1644 90.9307 156.8177 169.5739 120.0934 20.5099 7.4806 53.2991 37.2508 29.3546 6.4879 38.1346 11.2320 45.9895 18.2555 46.3328 10.8927 16.4397 18.4882 56.4291 13.1398 12.5037 22.7852 31.0606 39.5991 27.7336 8.2571 66.3895 7.6273 33.0091 24.1938 22.5075 25.8960 13.1861 4.3596 6.5520 35.7178 7.9759 4.2159 15.9530 829.8268 37.5177 27.8735
temp: 298.150 k
press: 1.00000 atm
elementType: 7 7 7 6 1 1 1 6 6 1 1 6 1 1 6 1 1 1 6 1 1 6 1 1 6 1 1 1 11 1 1 1 6 1 1 1 6 6 6 6 1 1 1 1 1 1 1 1 6 6 6 6 6 1 1 1 1 1 1 1 1 1 1 7 6 6 6 6 6 6 6 6 1 1 1 1 1 1 16
symmnumber: 1
zpe: 1865860.9 jmol-1
zpe.correction: 0.710669 hartree
zpe.thermalcorrener: 0.747441 hartree
zpe.thermalcorrenthalpy: 0.748386 hartree
zpe.thermalcorrgfe: 0.642977 hartree
zpe.sumelectzpe: -1797.550499 hartree
zpe.sumelectthermal: -1797.513727 hartree
zpe.sumelectthermalent: -1797.512783 hartree
zpe.sumelectthermalfe: -1797.618192 hartree
dipole: -6.7204 5.5842 1.8016
dipole: 8.9215
quadrupole: -211.7855 -196.5669 -201.9776
quadrupole: 1.1959 2.6174 -2.9438
quadrupole: -8.3422 6.8764 1.4658 1.1959 2.6174 -2.9438
hfenergy: -1798.2611682 hartree
pointgroup: C01 [X(C26H47N4Na1S1)]
dipole: -2.7149321 2.0948484 0.7488333 debye
polarizability: 405.4349308|-1.3515808|301.5444625|8.9434181|-19.7498032|308.3969593 unknown
InChI: InChI=1/C9H23N3.C9H19N.C8H5S.Na/c1-10(2)6-8-12(5)9-7-11(3)4;1-8(2)6-5-7-9(3,4)10-8;1-2-4-8-7(3-1)5-6-9-8;/h6-9H2,1-5H3;10H,5-7H2,1-4H3;1-5H;/rC17H28N3NaS.C9H19N/c1-18(2)10-11-20(5)13-12-19(3,4)21(20)17-14-15-8-6-7-9-16(15)22-17;1-8(2)6-5-7-9(3,4)10-8/h6-9,14H,10-13H2,1-5H3;10H,5-7H2,1-4H3
charge 0 multiplicity 1
79 atoms
N  -2.99183715 1.90178382 0.45680768
N  0.77223336 2.45228602 1.48907144
N  -0.60408698 2.74606846 -1.24496493
C  -0.35669526 2.27382277 -2.60504615
H  -0.22022776 3.10759433 -3.31601668
H  -1.19872676 1.66693582 -2.94886499
H  0.53766412 1.64690481 -2.62197794
C  -3.05021985 2.52125621 -0.86978489
C  -1.8810303 3.45621798 -1.16573699
H  -2.09082559 3.99292679 -2.10628735
H  -1.82415557 4.22608383 -0.39240794
C  0.52629367 3.53631784 -0.75048658
H  0.54872429 4.53827515 -1.21646961
H  1.44171084 3.02262972 -1.05928883
C  -3.29116554 2.86272284 1.51134309
H  -3.21974315 2.37000851 2.48500075
H  -4.30619923 3.28794473 1.41186769
H  -2.57599373 3.6880251 1.50470472
C  0.5292087 3.70117122 0.76921707
H  1.281408 4.46568202 1.036737
H  -0.43676047 4.09907624 1.09685874
C  2.19619396 2.11692759 1.49123937
H  2.56515216 1.99190528 0.47174637
H  2.34980166 1.16181385 1.99405471
C  0.28074584 2.52723623 2.85900368
H  -0.79526101 2.72408611 2.86239765
H  0.78139081 3.31566443 3.44955068
H  0.45364898 1.56927668 3.35811814
Na -0.62583503 0.75184337 0.217259
H  -3.99875692 3.07502854 -1.00224019
H  -3.05366244 1.71469781 -1.61085464
H  2.7909523 2.89771917 1.99826966
C  -3.93928854 0.79217932 0.52376678
H  -3.95534818 0.38437473 1.53785529
H  -4.96655778 1.10325749 0.26345568
H  -3.61593941 -0.00877522 -0.14416809
C  -1.65501333 -2.44438946 1.16920197
C  -1.92062267 -2.32629513 -1.37155508
C  -1.34331374 -1.4262671 2.2783993
C  -1.83681863 -1.20245833 -2.41379899
H  -3.7513814 -2.00159439 1.40990938
H  -4.02749624 -1.90643608 -1.15998114
H  -1.49985292 -1.86123095 3.27093774
H  -2.17770456 -1.54525332 -3.39641967
H  -0.29684253 -1.10298511 2.21645309
H  -0.80209264 -0.85487267 -2.50923802
H  -1.99074435 -0.54679322 2.18600746
H  -2.46151877 -0.35564708 -2.10850103
C  -3.1219616 -2.89062731 1.27572528
C  -0.70498911 -3.64568938 1.36633604
C  -3.37797769 -2.79012685 -1.2194047
C  -1.02575185 -3.48130032 -1.86961902
C  -3.59706789 -3.64158512 0.03130642
H  -3.24653455 -3.50887438 2.17245085
H  -0.98207568 -4.50554159 0.75410676
H  0.31924415 -3.36386921 1.10444777
H  -0.71800765 -3.97299275 2.41178246
H  -3.67618579 -3.33974529 -2.11971803
H  -1.27378273 -3.73396666 -2.90619538
H  -1.14052779 -4.38995643 -1.27620413
H  0.02624848 -3.18152918 -1.83069255
H  -4.65836216 -3.89340844 0.13032477
H  -3.06470901 -4.59532901 -0.06229595
N  -1.46279744 -1.72737492 -0.10395414
C  3.95451844 -0.43240799 -0.75529593
C  3.66409395 -1.0627574 0.47273682
C  4.7322 -1.45765134 1.29483733
C  6.03673618 -1.2253605 0.89092735
C  6.30681871 -0.60100652 -0.33675626
C  5.26930395 -0.20325854 -1.16777472
C  1.40799507 -0.67264571 -0.28026818
C  2.23785293 -1.17939851 0.68777026
H  4.52956362 -1.94568664 2.24488742
H  6.86164072 -1.5307154 1.52814968
H  7.33542696 -0.42810163 -0.63884461
H  5.47604732 0.27938234 -2.11870638
H  -0.45509613 -1.51824548 -0.2141882
H  1.85510371 -1.63873541 1.59955324
S  2.44667759 -0.04080319 -1.55832565
