program: Gaussian 16
title: displacement calc 0.5
version: ES64L-G16RevC.01
frameworkgroup: C1[X(C30H55BN5NaS)]
method: RwB97XD
basis: Gen
operation: Freq
keyword: #P
keyword: Geom=AllCheck
keyword: Guess=TCheck
keyword: SCRF=Check
keyword: GenChk
keyword: RwB97XD/ChkBasFreq
converged: YES YES NO NO
title: Mulliken charges:
elementType: N N N C H H H C C H H C H H C H H H C H H C H H C H H H Na H H H C H H H C C C C C C C C H H H H H S C C C C C H H H H H H C H H H C H H H C H H H C H H H N B N C C H H H C H H H C H H H
charge: -0.667761 -0.554020 -0.604098 -0.194085 0.121144 0.170111 0.157801 -0.057560 -0.054748 0.130273 0.108794 -0.086909 0.132064 0.142861 -0.181279 0.139304 0.132633 0.125450 -0.056337 0.132197 0.115798 -0.224841 0.169578 0.161473 -0.197062 0.134758 0.139535 0.133542 0.483173 0.123092 0.163560 0.134623 -0.192904 0.135876 0.131740 0.168495 -0.215490 0.110967 -0.154920 -0.134200 -0.133174 -0.120083 -0.325016 -0.238920 0.100890 0.102618 0.103240 0.122960 0.074531 0.067160 -0.193385 0.132421 0.128194 -0.194291 -0.233140 0.117480 0.110674 0.109803 0.114154 0.115302 0.116546 -0.381967 0.120535 0.162501 0.121872 -0.335347 0.186183 0.104855 0.117828 -0.327243 0.107784 0.188300 0.105820 -0.383537 0.169456 0.119076 0.119111 -0.720174 0.842436 -0.810381 0.139915 -0.337296 0.125678 0.118348 0.117027 -0.354892 0.123708 0.108601 0.123175 -0.318270 0.123236 0.116632 0.106439
chargesum: -0.00000
title: Mulliken charges with hydrogens summed into heavy atoms:
elementType: N N N C C C C C C C C Na C C C C C C C C C S C C C C C C C C C N B N C C C C
charge: -0.667761 -0.554020 -0.604098 0.254971 0.229092 0.184320 0.188016 0.216107 0.191658 0.240834 0.210773 0.483173 0.243205 -0.215490 0.110967 -0.054030 -0.031583 -0.029933 0.002877 -0.325016 -0.164388 0.067160 0.034768 0.132421 0.128194 0.029666 -0.001291 0.022941 0.073518 0.074661 0.024107 -0.720174 0.842436 -0.810381 0.139915 0.023756 0.000592 0.028037
chargesum: 0.00000
polarizability: 4.04681811e+02 -4.23695097e+01 4.28911841e+02 7.15601670e+00 4.83912993e+00 3.61073817e+02
1716.lowfreq: -2.3885 0.0016 0.0017 0.0018 1.4567 3.7597 5.8413 17.9071 19.0832
redmass: 4.5177 4.7823 4.1841 3.3029 4.6410 3.9676 4.2661 4.0914 4.0697 3.7482 3.8048 4.2186 3.8955 3.7362 3.1277 3.1805 3.8959 3.3607 3.0703 3.8979 2.7835 1.9327 3.3822 2.8184 2.7884 2.0538 2.3213 6.3028 7.0762 5.3637 2.0224 1.1291 1.3411 3.7226 1.2303 2.2363 1.1932 1.1777 1.4670 1.5206 1.4777 1.3877 1.7480 1.6682 1.4407 1.1456 1.5459 1.9044 1.8466 1.9017 5.7719 2.3742 2.3679 2.3471 2.2596 2.1690 1.9411 2.4500 1.9987 2.1095 1.9900 3.0679 2.7735 1.9977 2.0520 2.8611 2.1640 2.8282 2.9466 7.9056 5.0961 3.6402 3.8504 7.4487 3.3939 2.5274 4.9127 3.5615 2.4339 2.9168 3.4611 8.9737 6.5644 3.6805 2.4072 5.6485 1.6072 2.3349 2.8318 2.3086 2.6960 3.0250 1.3541 1.4507 1.5115 5.1208 2.3372 1.8319 1.7264 1.8885 2.0687 2.0471 1.3649 1.5967 1.4766 1.2043 2.2212 2.2092 1.5637 1.2626 1.6413 1.4741 2.0390 1.4574 1.8140 1.5476 1.4140 2.1995 2.0891 1.6462 1.7216 1.4526 1.6496 1.7506 4.6025 1.6029 1.8774 1.3577 1.6682 1.3529 1.3739 1.4826 1.3743 1.8079 2.5707 2.2028 1.1751 1.4712 1.7591 1.2496 2.3678 1.8791 2.1533 2.8916 2.7240 2.7466 2.5137 2.6935 2.9593 1.8699 2.2425 1.9367 2.0193 1.9291 2.3531 1.6625 1.2826 1.5240 1.4997 2.4372 1.3965 6.1671 1.4679 1.6460 1.3362 1.4234 1.3354 1.3495 1.3166 1.3510 1.3563 1.2416 1.2377 1.2458 1.4239 1.3431 1.1779 2.9529 1.2368 1.1602 1.0927 1.0768 1.0766 1.1607 1.0597 1.0594 1.0635 1.0544 1.0945 1.0613 1.0703 1.0748 1.1012 1.0939 1.0570 2.2349 1.0821 1.0680 1.0627 1.0623 1.1035 1.0650 1.0690 1.0771 1.0613 1.0676 1.0610 1.0607 1.0578 1.1083 1.3755 1.8186 1.0878 1.0753 1.0621 6.0880 6.1767 11.5904 1.0715 1.0714 1.0738 1.0598 1.0572 1.0568 1.0618 1.0571 1.0685 1.0625 1.0360 1.0625 1.0359 1.0366 1.0363 1.0374 1.0624 1.0419 1.0875 1.0461 1.0809 1.0995 1.0815 1.0990 1.0787 1.0789 1.0859 1.1044 1.0869 1.1026 1.0802 1.1012 1.0867 1.1015 1.1013 1.1012 1.0891 1.1021 1.1026 1.1025 1.1026 1.1038 1.1021 1.0988 1.1008 1.1023 1.0947 1.0974 1.1031 1.0853 1.0988 1.0882 1.0942 1.1007 1.0984
irintensity: 0.2791 0.1775 0.2491 0.0706 0.5198 1.0368 1.0790 1.7080 0.9610 1.0233 1.7327 2.1240 0.3641 0.6408 0.1543 2.5114 0.6005 1.2504 0.6695 4.8310 0.6783 0.3693 1.7991 1.1416 17.0973 3.3761 3.4005 10.9097 10.8344 7.5466 2.7347 0.9600 1.3189 12.6387 2.0457 9.6751 0.8161 0.8080 0.5031 0.1097 0.0674 0.2084 0.7682 1.4602 0.6038 0.1586 0.4663 1.3070 0.3304 1.6992 0.2151 2.5628 0.4013 1.5854 3.7658 3.2283 1.7626 0.1858 4.4856 2.1056 10.2112 1.6223 3.8097 1.9409 1.0113 3.5399 2.4432 2.9105 1.7664 1.4751 16.9864 9.9862 16.8362 3.7476 14.7675 6.2176 12.9842 4.2915 4.8718 4.7732 31.7563 4.8297 3.8493 16.3156 16.1746 31.9343 18.3966 9.7845 1.7614 4.5071 21.0596 24.7082 34.5229 3.7390 0.0074 1.9859 1.7550 2.1744 1.0380 7.8463 5.4464 2.8947 2.4993 1.2262 0.6341 0.0878 32.9766 4.4107 4.8733 0.0104 4.7958 4.4416 18.9668 0.6969 16.5501 5.6448 0.3972 8.1189 22.2563 5.1910 10.6754 4.2052 16.4443 4.8879 13.4909 2.5564 21.5017 2.3179 5.2621 1.9840 0.3352 6.5138 2.5987 32.0660 10.0945 23.0029 1.6861 15.8334 43.4029 0.2570 44.8991 7.0968 2.4925 30.4265 15.2518 10.4069 14.7064 60.1305 10.2860 1.8390 0.2595 27.5577 2.8126 5.9801 6.9340 33.0991 9.3781 6.0285 23.6907 13.6042 17.7863 9.2662 0.1602 8.8454 12.0202 2.1511 19.3854 3.6716 5.9304 21.8479 9.2051 13.6402 10.1644 6.6087 9.5548 1.5241 0.7825 22.6777 0.0872 1.1053 0.7696 2.4872 3.4456 1.9556 3.8225 2.0352 4.0916 0.6701 7.5592 8.9830 17.6291 5.2474 4.1601 13.3253 4.3795 13.4277 4.6225 12.1209 7.2557 7.4613 16.7586 30.4473 5.0898 0.8732 1.4413 10.1915 1.5166 10.8217 35.3956 25.9647 7.4773 3.6321 8.4814 19.3610 1.2383 0.9283 3.1576 868.1881 11.6340 18.3828 76.8670 89.4289 37.1372 47.9356 77.2574 193.2663 203.9221 19.4314 21.3299 17.8379 22.2371 37.5219 2.6466 45.2671 19.0044 26.3871 11.6521 16.6782 20.1137 35.5722 22.4936 33.3285 15.5692 23.8798 27.2433 38.9296 11.5894 24.0439 7.1157 6.1685 40.3448 42.7414 35.6969 60.4135 48.2810 17.7708 10.0563 19.5940 12.5935 4.1550 21.5251 41.4163 43.2445 8.0116 9.7867 6.9928 7.7235 4.7902 12.4484 1.5219 38.9088 8.0069 46.8335
temp: 298.150 k
press: 1.00000 atm
elementType: 7 7 7 6 1 1 1 6 6 1 1 6 1 1 6 1 1 1 6 1 1 6 1 1 6 1 1 1 11 1 1 1 6 1 1 1 6 6 6 6 6 6 6 6 1 1 1 1 1 16 6 6 6 6 6 1 1 1 1 1 1 6 1 1 1 6 1 1 1 6 1 1 1 6 1 1 1 7 5 7 6 6 1 1 1 6 1 1 1 6 1 1 1
symmnumber: 1
zpe: 2185305.2 jmol-1
zpe.correction: 0.832339 hartree
zpe.thermalcorrener: 0.876746 hartree
zpe.thermalcorrenthalpy: 0.877691 hartree
zpe.thermalcorrgfe: 0.753831 hartree
zpe.sumelectzpe: -2034.268043 hartree
zpe.sumelectthermal: -2034.223636 hartree
zpe.sumelectthermalent: -2034.222692 hartree
zpe.sumelectthermalfe: -2034.346551 hartree
dipole: 4.0525 -5.0368 0.4395
dipole: 6.4796
quadrupole: -218.5730 -250.3755 -234.2542
quadrupole: 5.9429 -0.4410 2.4875
quadrupole: 15.8279 -15.9746 0.1467 5.9429 -0.4410 2.4875
hfenergy: -2035.1003821 hartree
pointgroup: C01 [X(C30H55B1N5Na1S1)]
dipole: 1.0394129 -2.3277638 0.0002604 debye
polarizability: 385.0537823|-31.881251|446.9718243|6.1182556|9.4762143|362.6418628 unknown
InChI: InChI=1/C13H27BN2.C9H23N3.C8H5S.Na/c1-11(2,3)15-14-16-12(4,5)9-8-10-13(16,6)7;1-10(2)6-8-12(5)9-7-11(3)4;1-2-4-8-7(3-1)5-6-9-8;/h8-10H2,1-7H3;6-9H2,1-5H3;1-5H;/q-1;;;+1/rC30H55BN5NaS/c1-28(2,3)35(31-34-29(4,5)18-15-19-30(34,6)7)37(27-24-25-16-13-14-17-26(25)38-27)36(11,12)23-22-33(10)21-20-32(8)9/h13-14,16-17,24H,15,18-23H2,1-12H3
charge 0 multiplicity 1
93 atoms
N  2.6181976 -0.93880553 2.25563628
N  3.24411479 -1.69806342 -1.65300956
N  3.67587595 0.8362045 -0.10738518
C  3.34669873 2.25858503 -0.17340985
H  4.25520881 2.88805663 -0.15806706
H  2.69899964 2.53770792 0.65839907
H  2.78069581 2.46420718 -1.08451047
C  3.35609251 0.32586096 2.31400388
C  4.33582237 0.51989505 1.15905241
H  5.0480179 1.319487 1.43316574
H  4.93425764 -0.38665735 1.0348945
C  4.48677885 0.45971927 -1.25770977
H  5.52819315 0.82373675 -1.16580642
H  4.07123696 0.96473396 -2.13486385
C  3.4610952 -2.08259976 2.57061542
H  2.8656916 -2.99803408 2.53196446
H  3.91514791 -2.00466383 3.575529
H  4.26510411 -2.18475914 1.83686674
C  4.54343976 -1.0401354 -1.52158487
H  5.15077118 -1.18888457 -2.4359971
H  5.08028665 -1.54679389 -0.71107875
C  2.43384847 -1.12557947 -2.72528299
H  2.18964484 -0.08145845 -2.50831158
H  1.48915212 -1.67271438 -2.79172707
C  3.4656734 -3.11953563 -1.88481836
H  4.01178008 -3.55173928 -1.04046502
H  4.04739322 -3.30663375 -2.80578967
H  2.5122842 -3.64246149 -1.97214687
Na 1.51266108 -0.742981 0.07432775
H  3.90712523 0.40796751 3.26984907
H  2.6188781 1.13396563 2.29049088
H  2.93842827 -1.16945942 -3.70721827
C  1.46538479 -0.88569327 3.14961368
H  0.89354095 -1.8148593 3.07288333
H  1.75794234 -0.74193881 4.20515955
H  0.81314511 -0.06525391 2.84120753
C  -0.48884352 3.6318945 -0.50829645
C  -0.31383412 3.61799691 0.89237357
C  -0.54402374 4.80388912 1.60891731
C  -0.93092986 5.95290437 0.9383991
C  -1.09957721 5.94831797 -0.45477993
C  -0.88090113 4.78887758 -1.18562016
C  0.22521508 1.30886698 0.43872913
C  0.08572416 2.31004542 1.36743726
H  -0.41845632 4.81387636 2.68875503
H  -1.10793345 6.86874025 1.49508578
H  -1.40370559 6.8577139 -0.96445699
H  -1.01213517 4.78172423 -2.26405767
H  0.24869792 2.1407965 2.43300539
S  -0.15240485 2.02788674 -1.13105471
C  -4.67524217 -0.81060995 1.40976728
C  -3.2933429 -0.18531766 1.14951341
C  -3.6300105 -0.653931 -1.37322508
C  -5.01096549 -1.24698432 -1.03546003
C  -5.63138222 -0.65822405 0.22902883
H  -4.53554417 -1.87978114 1.61961641
H  -5.10111235 -0.35609213 2.31155102
H  -5.67483528 -1.10109013 -1.89539677
H  -4.89270865 -2.3304633 -0.89840337
H  -5.88215196 0.39743474 0.07492955
H  -6.57609966 -1.16700523 0.44724172
C  -2.99206596 -1.51168697 -2.47243154
H  -3.63901071 -1.50165545 -3.35406991
H  -2.0109113 -1.12483742 -2.76513256
H  -2.87554195 -2.55141619 -2.15237257
C  -3.74960636 0.77896031 -1.92090884
H  -2.76648062 1.255511 -1.94481394
H  -4.15256 0.74386025 -2.93805084
H  -4.41676247 1.40704974 -1.33125581
C  -3.3659876 1.35157049 1.16139209
H  -3.48023993 1.69581745 2.19375788
H  -2.44587426 1.78012148 0.76316472
H  -4.21206347 1.74449973 0.59781395
C  -2.32813013 -0.6084626 2.26204513
H  -1.34502636 -0.15806195 2.0952642
H  -2.71357479 -0.2594311 3.2242898
H  -2.22477477 -1.69747575 2.31419696
N  -2.77783865 -0.71783441 -0.1486585
B  -1.6016412 -1.42830368 -0.1830969
N  -0.53620071 -2.1613798 -0.25855757
C  -0.40254057 -3.6072356 -0.15978443
C  0.86720296 -3.9214708 0.64386042
H  1.74244161 -3.44607091 0.18999644
H  0.76215867 -3.53612556 1.66288479
H  1.05120217 -4.99989968 0.70111045
C  -1.60661303 -4.25335505 0.54529757
H  -2.53450223 -4.03342193 0.00518579
H  -1.49709625 -5.34187059 0.60175321
H  -1.70702159 -3.86710471 1.56489935
C  -0.28428469 -4.19411168 -1.57478949
H  -1.22327673 -4.06960805 -2.12162012
H  0.4931234 -3.67398905 -2.13969433
H  -0.04346069 -5.26246844 -1.54427561
