program: Gaussian 16
title: displacement calc 0.5
version: ES64L-G16RevC.01
frameworkgroup: C1[X(C30H55BN5NaS)]
method: RwB97XD
basis: Gen
operation: Freq
keyword: #P
keyword: Geom=AllCheck
keyword: Guess=TCheck
keyword: SCRF=Check
keyword: GenChk
keyword: RwB97XD/ChkBasFreq
converged: YES YES NO YES
title: Mulliken charges:
elementType: N N N C H H H C C H H C H H C H H H C H H C H H C H H H Na H H H C H H H C C C C C C C C H H H H H S C C C C C H H H H H H C H H H C H H H C H H H C H H H N B N C C H H H C H H H C H H H
charge: -0.642421 -0.592891 -0.610577 -0.189783 0.132994 0.149921 0.147216 -0.056900 -0.066586 0.134955 0.122422 -0.083001 0.137711 0.140891 -0.185211 0.160484 0.134766 0.121916 -0.054065 0.137223 0.114991 -0.215542 0.155340 0.171535 -0.198505 0.134639 0.140708 0.154646 0.511812 0.128844 0.144266 0.136569 -0.184263 0.164648 0.135042 0.134480 -0.209174 0.099822 -0.158835 -0.135283 -0.126799 -0.137998 -0.343060 -0.131496 0.122215 0.119765 0.120106 0.138538 0.113477 0.221206 -0.193161 0.176208 0.161642 -0.195060 -0.224653 0.108319 0.086623 0.089946 0.101160 0.100358 0.102682 -0.347088 0.098574 0.135383 0.111620 -0.329235 0.150946 0.093810 0.103732 -0.335261 0.089651 0.132085 0.104963 -0.343585 0.093840 0.101097 0.123536 -0.713368 0.825172 -0.898302 0.159630 -0.321685 0.089910 0.107254 0.106162 -0.307236 0.123674 0.079317 0.098736 -0.305037 0.123779 0.080811 0.092291
chargesum: -0.00000
title: Mulliken charges with hydrogens summed into heavy atoms:
elementType: N N N C C C C C C C C Na C C C C C C C C C S C C C C C C C C C N B N C C C C
charge: -0.642421 -0.592891 -0.610577 0.240349 0.216211 0.190790 0.195600 0.231955 0.198150 0.247902 0.231489 0.511812 0.249907 -0.209174 0.099822 -0.036620 -0.015518 -0.006693 0.000540 -0.343060 -0.018019 0.221206 0.001780 0.176208 0.161642 -0.003954 -0.021613 -0.001511 0.019253 -0.008562 -0.025112 -0.713368 0.825172 -0.898302 0.159630 -0.018359 -0.005510 -0.008156
chargesum: 0.00000
polarizability: 4.09873928e+02 3.88182547e+01 4.14069558e+02 -7.03658082e+00 9.08462625e+00 3.58419843e+02
1716.lowfreq: -2.6913 -0.0014 -0.0004 0.0012 2.3517 4.4685 19.0853 31.6396 38.5047
redmass: 4.3157 3.8582 4.7792 4.3019 4.2620 3.7705 3.4280 4.3237 3.3575 4.7465 3.3541 3.8721 3.3751 3.3042 2.9165 3.0545 3.2072 3.2643 3.1501 3.0055 3.5290 3.3995 2.5852 5.6668 2.2764 1.7646 3.3401 3.0762 2.7438 3.0300 3.3293 1.2701 1.3118 1.3209 1.1941 1.1987 1.1469 1.2581 1.5826 1.4804 1.1974 1.8750 2.1437 1.9752 2.2893 1.9428 2.0565 1.2394 2.4579 2.1859 4.0086 2.5832 2.2159 2.3915 2.4894 2.1518 2.1402 2.4139 1.9265 2.1043 2.0609 2.9883 1.9712 2.0809 2.7472 2.1789 2.5328 3.2516 3.2021 7.3130 3.6003 3.3244 4.0549 4.4520 2.4809 2.5100 3.5731 2.8927 4.5097 6.8023 6.4273 5.7761 6.0111 3.0884 3.1750 1.3892 2.3202 2.9349 2.6398 3.0196 3.1162 1.2738 1.6012 3.6290 2.3790 1.4805 1.6932 1.6993 1.9133 1.8776 2.3569 1.7061 1.5832 1.2155 1.3644 2.2207 1.5428 2.1758 1.7245 3.4739 1.2761 1.4560 1.3362 2.1195 1.3978 1.6288 1.7508 2.0572 2.1335 1.7492 1.9697 1.5673 1.8780 1.5078 1.6049 4.2390 1.8473 1.4418 1.7441 1.3397 1.3311 3.2531 1.3932 1.7045 1.5403 2.0494 1.2050 1.4507 1.7063 1.3567 2.1555 1.8779 2.2834 2.7775 2.6683 2.9949 2.8519 1.8300 2.9382 2.3017 1.9376 2.0775 2.5276 1.9765 2.3372 1.4491 2.3883 1.3854 1.3683 1.5635 1.4272 5.1373 1.4918 1.2867 1.5439 1.3696 1.4528 1.3866 1.2861 1.3559 1.3589 1.2373 1.2293 1.2334 1.4809 1.4188 1.1793 1.1658 1.1633 1.0645 1.0735 1.0882 1.2728 1.8674 1.1570 1.0751 1.0672 1.0682 1.0559 1.0864 1.0701 1.0662 1.0674 1.0779 1.0644 1.0599 1.0786 1.0996 1.0618 1.1275 1.0615 1.9727 1.1692 1.1013 1.0702 1.0763 1.0898 1.0745 1.0680 1.0897 1.1326 1.4017 1.0739 1.4043 1.4063 5.6350 6.2704 6.2711 1.0719 1.0711 1.0709 1.0568 1.0560 1.0618 1.0574 1.0578 1.0736 1.0347 1.0600 1.0598 1.0423 1.0513 1.0542 1.0439 1.0471 1.0409 1.0427 1.1001 1.0875 1.1040 1.0893 1.0813 1.1038 1.0802 1.0848 1.1005 1.0844 1.0995 1.0793 1.0987 1.0868 1.0962 1.0761 1.0995 1.0969 1.0920 1.0926 1.1012 1.1015 1.1007 1.0990 1.1034 1.0980 1.0980 1.1038 1.0982 1.1002 1.0864 1.0964 1.0888 1.0942 1.0914 1.0983
irintensity: 0.6975 0.1473 0.1810 1.3872 1.0031 1.0261 0.5866 0.5154 0.6908 0.6717 0.5735 0.8489 1.1094 0.6862 0.2271 0.5846 0.6612 0.9943 1.0428 1.3338 0.1860 1.7605 1.9482 14.8999 1.0832 2.3734 5.9094 5.2760 0.4062 2.6535 6.7800 1.6180 0.6336 0.1747 0.1665 0.7933 1.3381 0.7479 5.5711 3.7986 0.3432 0.2951 0.0971 1.2614 0.6861 2.0890 0.7257 0.1564 0.2507 0.7460 0.3168 4.2582 0.7998 3.0022 1.5336 1.0469 2.6213 0.1579 5.5524 3.3186 7.8006 3.9562 1.2035 0.6525 0.8210 2.6042 0.2970 1.6741 0.1895 0.4148 6.3704 5.9311 4.4059 8.8924 4.8416 1.5802 12.3787 4.6228 1.7472 7.4649 5.6997 24.3330 13.9764 15.3714 12.8587 34.4253 7.4303 0.6430 17.4287 23.0597 26.8075 20.8248 0.6592 14.3362 4.2129 23.2380 0.2856 0.0876 9.8573 0.2538 9.7138 1.7337 2.1753 0.3795 4.1068 26.3826 4.4397 5.4850 5.1204 13.8971 0.0337 0.1741 0.7595 14.1526 0.7965 39.6170 19.6762 43.7333 18.0217 13.7925 24.0541 8.7942 3.8667 13.1263 2.8358 15.1122 20.1435 2.8740 5.2597 2.4467 0.4849 105.6174 3.6725 22.3037 15.6328 31.3730 5.3334 18.4041 30.7296 6.1094 34.4371 9.1456 4.9147 12.3698 7.7611 15.4040 23.9984 2.2520 3.9739 0.6991 2.0383 41.4251 126.5219 2.0729 5.2831 1.2964 15.0909 22.7697 9.1570 24.0147 18.9399 3.6609 0.0741 11.1959 10.8321 17.1631 2.6408 8.1781 1.0738 6.5622 17.1448 16.5572 23.0207 6.2845 5.7986 1.8963 0.3798 1.0319 3.0594 0.6458 0.9004 4.1127 6.4915 19.0509 2.1003 8.7197 3.0893 0.5331 2.9529 5.3206 0.7364 0.2045 3.6294 1.0807 3.6570 5.7175 12.0986 35.7522 3.2706 12.9166 14.4761 17.2363 13.7724 57.5632 6.9760 5.7609 21.6532 12.7473 41.8988 16.0221 17.5297 147.1281 12.6845 108.8446 110.2690 9.3376 0.8581 2.9972 23.6649 30.3752 30.6807 36.6644 50.6535 78.3404 184.2464 90.1658 151.1064 38.4248 21.8185 29.3659 31.9354 22.8459 72.9966 20.0550 44.7009 53.9167 23.8321 59.2432 10.3259 21.4402 6.6592 26.6400 60.0953 15.1105 31.0038 50.5817 22.2071 28.7203 26.4421 10.8551 30.8989 44.5455 18.7036 76.3759 53.8581 43.9671 31.3237 52.1886 5.1345 10.5403 4.1258 10.7034 9.5825 4.9117 10.7072 25.3361 38.6569 3.0580 14.2418 0.4101 19.5376 11.8119 28.6151
temp: 298.150 k
press: 1.00000 atm
elementType: 7 7 7 6 1 1 1 6 6 1 1 6 1 1 6 1 1 1 6 1 1 6 1 1 6 1 1 1 11 1 1 1 6 1 1 1 6 6 6 6 6 6 6 6 1 1 1 1 1 16 6 6 6 6 6 1 1 1 1 1 1 6 1 1 1 6 1 1 1 6 1 1 1 6 1 1 1 7 5 7 6 6 1 1 1 6 1 1 1 6 1 1 1
symmnumber: 1
zpe: 2190424.3 jmol-1
zpe.correction: 0.834289 hartree
zpe.thermalcorrener: 0.877388 hartree
zpe.thermalcorrenthalpy: 0.878333 hartree
zpe.thermalcorrgfe: 0.761962 hartree
zpe.sumelectzpe: -2034.312754 hartree
zpe.sumelectthermal: -2034.269654 hartree
zpe.sumelectthermalent: -2034.268710 hartree
zpe.sumelectthermalfe: -2034.385081 hartree
dipole: 9.0261 -1.0376 1.6059
dipole: 9.2264
quadrupole: -232.2475 -243.2369 -235.9789
quadrupole: -3.6790 -1.7322 1.3774
quadrupole: 4.9070 -6.0825 1.1755 -3.6790 -1.7322 1.3774
hfenergy: -2035.1470428 hartree
pointgroup: C01 [X(C30H55B1N5Na1S1)]
dipole: 3.5660648 0.4922185 0.4661464 debye
polarizability: 390.5664463|33.177574|432.6120224|-10.9024793|4.7178058|359.1848598 unknown
InChI: InChI=1/C21H32BN2S.C9H23N3.Na/c1-19(2,3)23-22(18-15-16-11-8-9-12-17(16)25-18)24-20(4,5)13-10-14-21(24,6)7;1-10(2)6-8-12(5)9-7-11(3)4;/h8-9,11-12,15H,10,13-14H2,1-7H3;6-9H2,1-5H3;/q-1;;+1/rC30H55BN5NaS/c1-28(2,3)34(37-35(9,10)22-20-32(8)21-23-36(37,11)12)31(27-24-25-16-13-14-17-26(25)38-27)33-29(4,5)18-15-19-30(33,6)7/h13-14,16-17,24H,15,18-23H2,1-12H3
charge 0 multiplicity 1
93 atoms
N  2.37911794 -0.5912456 2.19317439
N  3.42962742 -1.43051054 -1.5806916
N  3.63241049 1.13029406 -0.00489093
C  3.27492091 2.5410623 -0.13412656
H  4.16040895 3.19770803 -0.06183941
H  2.56561969 2.83385107 0.6418645
H  2.78585537 2.71702398 -1.09337556
C  3.14374016 0.63722539 2.39311199
C  4.2021976 0.87152406 1.3204946
H  4.84407835 1.71269763 1.63627581
H  4.85685396 -0.00148413 1.26602255
C  4.55771985 0.75616713 -1.07349794
H  5.56972934 1.16344927 -0.89259486
H  4.20562756 1.22627502 -1.99644023
C  3.18255788 -1.7879291 2.40931393
H  2.54759761 -2.67034361 2.30816076
H  3.6481424 -1.80373772 3.41129423
H  3.97383706 -1.86664674 1.6584969
C  4.68748739 -0.74762627 -1.28976543
H  5.42006066 -0.905935 -2.10466798
H  5.11688919 -1.21857281 -0.39827614
C  2.84363592 -0.98261973 -2.84255083
H  2.56163561 0.07217361 -2.78337582
H  1.92911242 -1.54646209 -3.03885778
C  3.65309688 -2.87222387 -1.60356325
H  4.0220841 -3.20419101 -0.62814581
H  4.3874769 -3.16855297 -2.37366538
H  2.71479548 -3.392992 -1.80220613
Na 1.56684049 -0.54160391 -0.12077276
H  3.63762478 0.64183824 3.38333508
H  2.43495546 1.47250792 2.38772238
H  3.5331389 -1.11669027 -3.69499279
C  1.19928424 -0.61203466 3.05094312
H  0.58171536 -1.47822171 2.80355833
H  1.45938606 -0.6457741 4.12380224
H  0.60088398 0.28197103 2.86243211
C  0.03799202 3.03270877 -1.09370911
C  -0.18280814 3.05896961 0.29843082
C  0.1366662 4.22417922 1.01330221
C  0.66374021 5.3162208 0.34352948
C  0.86985183 5.27586511 -1.04446609
C  0.55378474 4.13860241 -1.7731483
C  -0.89651556 0.84471865 -0.16993863
C  -0.71032968 1.80627914 0.77914372
H  -0.03213511 4.26315969 2.08592829
H  0.9121219 6.21803339 0.8944226
H  1.27403 6.14490515 -1.55384462
H  0.71135645 4.10727637 -2.84713078
H  -0.97372336 1.65549733 1.8209667
S  -0.37922549 1.46567347 -1.74083005
C  -4.70910979 -1.6105675 1.67172761
C  -3.49880032 -0.67009015 1.50269826
C  -3.88155328 -0.63666408 -0.9928413
C  -5.12304838 -1.53478019 -0.79780507
C  -5.75908023 -1.40554737 0.58276208
H  -4.34578833 -2.6450906 1.62794774
H  -5.15382253 -1.45945453 2.66396786
H  -5.85881364 -1.30873444 -1.57996019
H  -4.81185202 -2.5773693 -0.94174313
H  -6.23290233 -0.42219534 0.69099131
H  -6.56366674 -2.14143486 0.69303
C  -3.20404935 -1.09038845 -2.2955813
H  -3.92565324 -1.0394519 -3.11754811
H  -2.3543823 -0.45428319 -2.56087605
H  -2.84532925 -2.11743559 -2.21730565
C  -4.31817767 0.83396288 -1.21979774
H  -3.44669385 1.4948667 -1.19722626
H  -4.80075319 0.93787579 -2.19820618
H  -5.02755067 1.18885663 -0.47146055
C  -3.92266335 0.77616515 1.8884605
H  -3.95636369 0.87958755 2.97919442
H  -3.21478242 1.5062854 1.49274921
H  -4.9133739 1.04224738 1.51683397
C  -2.42848881 -1.08558385 2.52385481
H  -1.60051399 -0.37097843 2.54168018
H  -2.86645771 -1.11183879 3.52709783
H  -2.01243819 -2.06850297 2.29719782
N  -2.95876923 -0.83012718 0.14129473
B  -1.47833576 -0.68977044 -0.09307468
N  -0.50152342 -1.62855923 -0.29343936
C  -0.57248941 -3.07714869 -0.37755825
C  0.52446442 -3.654556 0.53907683
H  1.50376409 -3.24015989 0.27054457
H  0.315123 -3.39054379 1.58208749
H  0.58693939 -4.7475412 0.4698731
C  -1.89785615 -3.76201753 0.0134961
H  -2.73347826 -3.39281233 -0.57976352
H  -1.81591663 -4.84626729 -0.1319876
H  -2.14663482 -3.58366557 1.0618159
C  -0.24602499 -3.48639043 -1.82689332
H  -1.02332394 -3.13496383 -2.51056376
H  0.69368164 -3.02129308 -2.13806386
H  -0.15331516 -4.57409749 -1.93557243
