program: Gaussian 16
title: displacement calc 0.5
version: ES64L-G16RevC.01
frameworkgroup: C1[X(C30H55BLiN5S)]
method: RwB97XD
basis: Gen
operation: Freq
keyword: #P
keyword: Geom=AllCheck
keyword: Guess=TCheck
keyword: SCRF=Check
keyword: GenChk
keyword: RwB97XD/ChkBasFreq
converged: YES YES NO YES
title: Mulliken charges:
elementType: N N N C H H H C C H H C H H C H H H C H H C H H C H H H H H H C H H H C C C C C C C C H H H H H S C C C C C H H H H H H C H H H C H H H C H H H C H H H N B N C C H H H C H H H C H H H Li
charge: -0.487904 -0.487026 -0.452337 -0.190318 0.131590 0.161858 0.166887 -0.083563 -0.055542 0.136847 0.129632 -0.061123 0.110245 0.162725 -0.181850 0.149079 0.133479 0.133926 -0.059271 0.154575 0.127879 -0.197915 0.118176 0.133583 -0.205207 0.144937 0.114312 0.128771 0.136286 0.150784 0.104519 -0.197145 0.138221 0.132997 0.174755 -0.221215 0.110913 -0.156461 -0.133609 -0.133264 -0.120094 -0.276916 -0.190807 0.101716 0.104570 0.105636 0.126909 0.073362 0.083169 -0.191172 0.132340 0.127830 -0.192557 -0.234243 0.117694 0.110660 0.113133 0.117283 0.116331 0.118852 -0.385246 0.119100 0.183188 0.112260 -0.329699 0.188537 0.114163 0.109688 -0.332321 0.104722 0.161661 0.115931 -0.383178 0.153125 0.123171 0.124567 -0.761246 0.912523 -0.616863 0.138791 -0.329970 0.122425 0.118763 0.109499 -0.348155 0.134538 0.109248 0.120842 -0.315512 0.113673 0.105414 0.116536 -0.237100
chargesum: -0.00000
title: Mulliken charges with hydrogens summed into heavy atoms:
elementType: N N N C C C C C C C C C C C C C C C C C S C C C C C C C C C N B N C C C C Li
charge: -0.487904 -0.487026 -0.452337 0.270018 0.203508 0.210937 0.211847 0.234635 0.223183 0.158363 0.182812 0.248829 -0.221215 0.110913 -0.054745 -0.029040 -0.027628 0.006815 -0.276916 -0.117445 0.083169 0.037182 0.132340 0.127830 0.037859 0.000940 0.029302 0.082690 0.049994 0.017685 -0.761246 0.912523 -0.616863 0.138791 0.020717 0.016473 0.020111 -0.237100
chargesum: 0.00000
polarizability: 4.49321190e+02 2.79761612e+01 3.58916469e+02 1.73830753e+00 -1.27886839e+01 3.74598298e+02
1716.lowfreq: -3.7436 -0.0010 -0.0008 0.0010 4.1887 5.1643 11.8571 23.6973 30.1179
redmass: 4.4168 4.7842 4.7234 3.7079 3.6466 3.2724 3.8903 4.2375 3.5441 3.2330 4.1143 4.5347 4.1445 3.1115 3.5817 3.7609 3.5048 5.4189 4.3723 2.1728 2.2863 2.9699 2.3554 2.3827 1.4840 2.1278 3.4270 3.1393 1.7181 4.2421 1.2610 1.7324 1.7449 1.2302 1.1214 1.4271 1.9637 1.2371 1.1932 1.3274 1.3807 1.6031 1.9838 1.5557 1.6184 1.8641 2.4015 2.7587 1.5052 5.0442 2.2307 2.2410 2.2059 2.8243 2.1040 2.4458 2.6339 2.3161 3.0430 3.1533 2.2108 2.0762 2.2168 3.0545 3.0102 2.2161 2.8492 3.1067 2.9982 3.2445 7.1988 4.3829 3.0560 3.6696 5.7476 3.9298 5.1522 3.6691 2.3905 2.6888 3.4178 8.6278 6.5357 3.7187 2.3867 1.5514 8.5814 2.8507 2.0850 2.2771 1.4053 2.6124 1.2874 1.4613 1.4988 2.4241 4.8520 3.4800 2.2132 1.6694 2.0560 1.8014 1.3654 1.6294 1.4655 1.2249 2.2660 1.5690 2.3434 1.5676 1.2640 1.4121 1.4599 2.0887 1.4546 2.5922 2.1816 1.4026 1.5861 1.7764 1.9887 1.5093 1.4621 1.6392 3.1813 1.9662 1.9146 2.0077 1.3525 1.2893 1.3326 1.4662 1.4708 1.9003 2.7359 2.0955 1.1811 1.4638 1.7164 1.3581 1.5397 2.3198 2.1792 2.8341 2.6959 2.7158 2.4179 2.6355 2.0359 1.8746 2.6006 1.9441 1.4526 1.9698 2.1215 1.8108 1.5393 2.2174 1.6300 2.2460 1.2357 6.2189 1.4615 1.5031 1.6749 1.4081 1.4247 1.3111 1.2908 1.2902 1.3839 1.4184 1.2309 1.2431 1.2377 1.1909 1.2055 1.6047 2.1027 1.1654 1.1129 1.0661 1.0781 1.0772 1.0875 1.0895 1.0755 1.0882 1.0617 1.0571 1.0504 1.0696 1.0725 1.0592 1.9703 1.2107 1.0633 1.0907 1.0706 1.0515 1.0647 1.0745 1.0784 1.0666 1.0608 1.0601 1.0611 1.0753 1.0779 1.0783 1.0809 1.0851 3.2456 1.0770 1.0562 6.1419 6.1972 11.5391 1.0583 1.0609 1.0705 1.0715 1.0557 1.0556 1.0570 1.0728 1.0712 1.0633 1.0638 1.0357 1.0365 1.0372 1.0372 1.0634 1.0408 1.0428 1.0444 1.0745 1.0758 1.0993 1.0881 1.0983 1.0789 1.0889 1.0802 1.1043 1.1028 1.0916 1.0926 1.0998 1.1027 1.1015 1.0894 1.0943 1.1020 1.1035 1.1009 1.1002 1.0989 1.1003 1.0990 1.0983 1.1013 1.0940 1.0931 1.1011 1.0993 1.0858 1.1022 1.0881 1.0943 1.1007 1.0983
irintensity: 0.2218 0.0464 0.4490 0.1797 0.3535 0.1101 0.5529 0.6676 0.2292 0.5738 0.5078 1.5939 1.5908 0.6567 0.6670 0.9106 0.6620 5.7652 0.6237 0.1513 0.0647 2.6553 0.5186 1.1840 1.2824 0.5282 0.6341 0.7221 0.9928 2.6275 0.2508 0.5918 1.0805 0.3747 0.1935 0.0925 0.2029 0.3852 0.2355 0.3346 0.1260 0.1778 1.4246 1.1867 1.5105 1.5030 6.0975 12.9346 1.4208 6.4543 13.8833 5.3229 10.8017 23.5941 4.6125 1.7221 11.0311 0.8799 3.9791 1.3133 0.3929 3.9008 14.9512 31.2262 9.5726 2.0863 5.5475 9.3035 13.3999 3.7005 7.3962 17.2576 25.3423 26.2638 2.2779 20.3605 12.0142 7.2897 5.2701 6.0972 34.6208 3.0322 3.2426 22.3266 16.1738 21.0782 52.3074 1.5409 12.0470 4.0620 8.7124 22.6032 37.7614 5.8264 0.0300 1.7655 6.5633 13.3271 5.0124 0.4420 2.4150 3.0368 3.0009 1.8228 1.0169 0.1593 12.1878 4.2389 19.3896 3.8785 0.0792 4.1407 1.2452 19.0596 5.7524 4.0790 7.5270 0.4189 3.9342 42.2293 25.7682 2.9008 12.0508 1.8772 9.9963 5.4418 13.6311 6.4726 1.8125 1.6419 3.3872 8.8256 5.7618 24.5669 5.8775 22.9497 2.0183 18.8206 12.0522 3.8930 14.8329 38.2450 1.1465 36.5169 10.6806 5.7856 9.4771 59.6902 1.3416 2.0847 2.1468 22.7192 2.9563 8.2109 5.6794 41.3606 11.2215 22.7684 25.8832 11.9364 2.5915 5.4012 0.0931 19.4040 10.4425 2.8970 6.1496 17.1576 8.7835 2.6821 9.5043 3.8271 20.9469 11.2938 0.4471 0.7196 2.2996 7.2131 15.8105 1.2024 3.3192 0.3416 2.5390 0.8452 4.5850 2.4169 2.6124 1.7280 1.8206 9.4562 1.1574 1.3712 5.3918 2.2331 18.7158 5.8208 5.2870 29.5594 6.6480 25.4915 0.8397 5.5119 13.9348 13.9000 9.7273 8.2684 5.5664 26.1785 2.6094 6.7152 49.6943 5.3649 1.5413 10.0054 3.5748 1.0849 2.3362 831.0774 31.1744 78.2650 78.3687 48.9625 36.0209 118.5887 77.5692 72.7961 122.2084 20.2558 27.2477 17.0397 25.7440 13.9338 14.3115 19.3166 25.6487 23.4474 13.5241 36.1231 42.9707 37.0807 7.2203 39.4931 25.5205 12.3525 29.7070 41.0078 2.3215 0.4706 32.5810 79.6127 20.0097 24.0404 9.6731 29.7584 22.9786 39.6475 8.5659 47.3955 14.8441 26.7651 5.2116 38.9097 12.8498 16.4245 5.3758 6.8699 15.1997 6.9743 1.5466 1.0502 33.5124 21.1169 43.5636
temp: 298.150 k
press: 1.00000 atm
elementType: 7 7 7 6 1 1 1 6 6 1 1 6 1 1 6 1 1 1 6 1 1 6 1 1 6 1 1 1 1 1 1 6 1 1 1 6 6 6 6 6 6 6 6 1 1 1 1 1 16 6 6 6 6 6 1 1 1 1 1 1 6 1 1 1 6 1 1 1 6 1 1 1 6 1 1 1 7 5 7 6 6 1 1 1 6 1 1 1 6 1 1 1 3
symmnumber: 1
zpe: 2191806.8 jmol-1
zpe.correction: 0.834815 hartree
zpe.thermalcorrener: 0.878198 hartree
zpe.thermalcorrenthalpy: 0.879142 hartree
zpe.thermalcorrgfe: 0.759968 hartree
zpe.sumelectzpe: -1879.530804 hartree
zpe.sumelectthermal: -1879.487421 hartree
zpe.sumelectthermalent: -1879.486477 hartree
zpe.sumelectthermalfe: -1879.605651 hartree
dipole: 3.3820 4.7923 -2.3398
dipole: 6.3150
quadrupole: -230.6157 -244.1629 -227.8647
quadrupole: -9.6267 -7.6397 4.1255
quadrupole: 3.5987 -9.9484 6.3497 -9.6267 -7.6397 4.1255
hfenergy: -1880.3656188 hartree
pointgroup: C01 [X(C30H55B1Li1N5S1)]
dipole: 1.3554542 1.6600696 -1.2568408 debye
polarizability: 451.107037|23.670397|353.2042799|-5.6735508|-10.398193|378.5246406 unknown
InChI: InChI=1/C13H27BN2.C9H23N3.C8H5S.Li/c1-11(2,3)15-14-16-12(4,5)9-8-10-13(16,6)7;1-10(2)6-8-12(5)9-7-11(3)4;1-2-4-8-7(3-1)5-6-9-8;/h8-10H2,1-7H3;6-9H2,1-5H3;1-5H;/q-1;;;+1/rC30H55BLiN5S/c1-28(2,3)35(31-34-29(4,5)18-15-19-30(34,6)7)32(27-24-25-16-13-14-17-26(25)38-27)36(10,11)22-23-37(32,12)21-20-33(8)9/h13-14,16-17,24H,15,18-23H2,1-12H3
charge 0 multiplicity 1
93 atoms
N  1.8971211 -1.25911558 -2.86977727
N  3.26449323 -0.65170722 3.25478289
N  2.90207739 -2.02873929 -0.23129905
C  2.26078896 -3.328502 -0.01277031
H  2.99872499 -4.14877696 -0.0359814
H  1.4837952 -3.50661183 -0.75785649
H  1.75522693 -3.33757642 0.95231137
C  2.94065729 -2.27590003 -2.69619041
C  3.75241436 -2.05425709 -1.42125197
H  4.52586867 -2.84131201 -1.3539368
H  4.27576357 -1.09421709 -1.48429154
C  3.62603558 -1.59503005 0.969899
H  4.38921496 -0.87577055 0.65951286
H  4.15107915 -2.43466008 1.45397352
C  2.38134124 -0.11063473 -3.62438574
H  1.62969088 0.68298311 -3.59862755
H  2.59471598 -0.36672464 -4.67727542
H  3.2976082 0.28132635 -3.17758838
C  2.66035917 -0.95018383 1.96401902
H  2.21246657 -0.05034171 1.49804068
H  1.83222616 -1.64081944 2.14518968
C  4.25237988 0.41039377 3.17855807
H  5.06214666 0.13958611 2.49583165
H  4.69506502 0.56900121 4.1661076
C  2.23303815 -0.31078678 4.22204021
H  1.51858993 -1.13367899 4.30948287
H  1.67142349 0.60088059 3.94018811
H  2.68718262 -0.14361615 5.20329822
H  3.62454581 -2.30136676 -3.56031568
H  2.46290871 -3.25793477 -2.65601233
H  3.82029658 1.37164879 2.83847435
C  0.7051697 -1.81116971 -3.50744353
H  -0.04852879 -1.02451083 -3.60139916
H  0.91727949 -2.21166813 -4.51404156
H  0.27995587 -2.59537178 -2.87797119
C  -2.50207556 -2.45072121 1.16846215
C  -2.82693191 -2.32157638 -0.19827384
C  -4.1228532 -2.66396909 -0.61765106
C  -5.04926723 -3.11864499 0.30663121
C  -4.70749924 -3.24424182 1.66200631
C  -3.43372003 -2.91207687 2.10105128
C  -0.56183556 -1.50080405 -0.2827017
C  -1.7138216 -1.80248298 -0.9632156
H  -4.39315353 -2.56739591 -1.66622507
H  -6.0519144 -3.38102194 -0.0183309
H  -5.44571081 -3.60279343 2.37307824
H  -3.16846579 -3.00426489 3.15034643
H  -1.81108112 -1.64316913 -2.03639922
S  -0.85389524 -1.91419208 1.41151417
C  -2.63037406 3.67917703 -1.30600559
C  -2.1960603 2.20601129 -1.41123041
C  -1.9710894 2.13171829 1.15955537
C  -2.42681698 3.60252857 1.20697713
C  -3.31105743 4.00131724 0.02501521
H  -1.73603595 4.30823595 -1.41297903
H  -3.29632936 3.91667917 -2.14375488
H  -2.95105074 3.78073317 2.15287671
H  -1.5297537 4.23667061 1.21019618
H  -4.27853421 3.49024514 0.08746495
H  -3.53135846 5.07260558 0.07572632
C  -0.88102042 1.90669464 2.21394968
H  -1.29198329 2.13012167 3.20246388
H  -0.54709837 0.86410186 2.21340882
H  -0.01963339 2.56026466 2.05718997
C  -3.12574947 1.16801505 1.48646243
H  -2.8821457 0.15288323 1.16921051
H  -3.28596978 1.15655978 2.5684444
H  -4.07114665 1.45630881 1.02742643
C  -3.41123059 1.27531087 -1.58000566
H  -3.77099023 1.34403036 -2.6112569
H  -3.1297387 0.24150738 -1.37387848
H  -4.2472789 1.53797192 -0.93333216
C  -1.31515811 2.01587998 -2.65191859
H  -1.00247649 0.96983675 -2.74270653
H  -1.88934924 2.28084565 -3.54392815
H  -0.42267557 2.64604411 -2.62678522
N  -1.39176188 1.88410838 -0.19520725
B  -0.05418567 1.60691434 -0.32849033
N  1.22355145 1.4189635 -0.4842499
C  2.28606079 2.42782004 -0.51341571
C  2.17312311 3.28901143 -1.78057402
H  2.19066459 2.66377202 -2.67745687
H  1.23754521 3.85846571 -1.77602843
H  3.0010225 4.0034241 -1.84226716
C  2.2028461 3.34400066 0.71697428
H  2.2430614 2.75104703 1.63621832
H  3.03317324 4.05819474 0.73047991
H  1.2669592 3.91416192 0.71403184
C  3.64929051 1.72835546 -0.50166248
H  3.78842917 1.1825046 0.43322244
H  3.71940077 1.01721246 -1.32786986
H  4.46505537 2.45220793 -0.59842811
Li 1.30595413 -0.6937798 -0.82727583
