program: Gaussian 16
title: displacement calc 0.5
version: ES64L-G16RevC.01
frameworkgroup: C1[X(C38H61BLiN5S2)]
method: RwB97XD
basis: Gen
operation: Freq
keyword: #P
keyword: Geom=AllCheck
keyword: Guess=TCheck
keyword: SCRF=Check
keyword: GenChk
keyword: RwB97XD/ChkBasFreq
converged: YES YES NO NO
title: Mulliken charges:
elementType: C C C C C C C C H H H H H S B N C C H H H C H H H C H H H C C C C C H H H H H H C H H H C H H H C H H H C H H H N N N N C H H H C C H H C H H C H H H C H H C H H C H H H H H H C H H H C C C C C C C C H H H H H H S Li
charge: -0.210659 0.083569 -0.161600 -0.142139 -0.133470 -0.130556 -0.306408 -0.125710 0.110448 0.111220 0.113548 0.136110 0.100505 0.246649 0.816037 -0.876518 0.170299 -0.321139 0.123583 0.117875 0.075260 -0.325319 0.087784 0.091862 0.101784 -0.326782 0.117284 0.112118 0.078720 0.174863 0.181325 -0.191102 -0.190340 -0.222323 0.092338 0.098555 0.081189 0.079137 0.098401 0.105218 -0.328042 0.108668 0.130301 0.080944 -0.367319 0.121360 0.081861 0.152472 -0.319467 0.125797 0.097185 0.089991 -0.377872 0.142904 0.145436 0.095752 -0.771727 -0.515000 -0.491852 -0.509610 -0.190475 0.150301 0.151835 0.147055 -0.062273 -0.081166 0.153656 0.136240 -0.091414 0.150913 0.173916 -0.174798 0.144997 0.151035 0.123858 -0.067429 0.156109 0.121167 -0.199648 0.154097 0.168925 -0.189767 0.130805 0.150801 0.160729 0.146702 0.152342 0.159277 -0.205571 0.143652 0.157651 0.166100 -0.218751 0.102277 -0.144404 -0.137553 -0.125466 -0.126277 -0.313733 -0.166789 0.115304 0.125694 0.129123 0.148585 0.291603 0.135326 0.269584 -0.007542
chargesum: -0.00000
title: Mulliken charges with hydrogens summed into heavy atoms:
elementType: C C C C C C C C S B N C C C C C C C C C C C C C N N N N C C C C C C C C C C C C C C C C C S Li
charge: -0.210659 0.083569 -0.051152 -0.030919 -0.019922 0.005554 -0.306408 -0.025206 0.246649 0.816037 -0.876518 0.170299 -0.004421 -0.043889 -0.018660 0.174863 0.181325 -0.000210 -0.030013 -0.018704 -0.008129 -0.011626 -0.006494 0.006220 -0.771727 -0.515000 -0.491852 -0.509610 0.258715 0.236770 0.208730 0.233415 0.245092 0.209847 0.282651 0.252569 0.261832 -0.218751 0.102277 -0.029099 -0.011859 0.003658 0.022308 -0.022130 -0.031463 0.269584 -0.007542
chargesum: 0.00000
polarizability: 5.30127362e+02 3.10859872e-01 4.90347500e+02 -2.32883937e+01 -9.94851788e+00 4.64866690e+02
1716.lowfreq: -4.3530 -0.0004 0.0010 0.0021 3.6179 5.2240 17.9890 21.4062 32.8236
redmass: 5.4313 4.4606 4.8357 3.9179 5.5261 4.9201 3.8930 4.3381 3.3704 4.3986 4.2505 4.2505 3.5115 4.6908 4.3854 4.0798 3.1738 4.2005 3.1658 3.5858 4.0915 3.5833 3.2097 3.7207 2.6178 3.4585 2.7561 2.2597 2.3701 1.7736 3.7755 3.8718 2.3999 2.2745 3.6757 1.8878 1.4508 1.8290 1.6456 1.3463 1.2601 1.5138 1.2580 1.4530 2.0453 1.2962 4.2118 1.2523 1.9604 1.5768 1.7065 1.6258 3.2902 2.2755 2.2139 2.2954 4.9910 2.0645 2.0757 3.3342 2.2732 2.1110 2.5716 2.4008 2.1547 2.4472 2.3795 2.9972 2.8079 2.2845 2.1579 2.2510 2.2515 2.5888 2.9018 3.4321 2.9829 2.3997 3.0447 5.3711 4.3111 5.4094 4.5108 3.2560 7.0190 4.2215 5.4238 3.5292 2.5179 2.4499 3.1498 3.6326 2.9252 6.3698 7.1776 6.0067 5.6741 6.4661 5.7604 3.6432 3.1689 3.6724 1.3764 1.2525 2.4500 2.5421 5.5607 2.5000 2.7770 1.7060 2.1674 1.2876 1.9747 2.4050 2.1367 1.8383 1.8173 1.8337 1.7589 1.6500 1.9409 1.9436 2.3827 1.4792 1.6338 1.3612 1.1975 1.3886 1.9997 1.6988 2.1995 1.6092 1.2579 1.2769 2.0175 1.5162 1.6022 2.0968 1.6309 1.8753 1.4524 2.0084 2.1424 2.1852 1.8996 1.9218 1.7599 1.5545 1.7852 1.6021 4.3086 1.9454 3.5585 1.2081 1.3967 1.7416 1.2987 1.2766 2.8889 1.6256 1.2671 1.4351 1.3556 1.4967 2.0156 1.2421 1.4494 1.1764 1.3534 1.7067 2.2681 1.9846 2.3399 2.9680 2.6154 2.7144 2.1625 1.8545 2.7861 2.9358 2.2672 1.8271 2.2735 2.0763 1.5032 2.0742 2.3496 1.3000 1.3868 2.2784 1.6900 1.5291 1.4422 6.6388 1.4427 5.5614 1.5916 1.3085 1.3396 1.5254 1.2996 1.3776 1.5911 1.3656 1.3092 1.2672 1.2317 1.2301 1.4511 1.4276 1.1685 1.1698 1.2069 1.2481 1.8004 2.3060 1.0550 1.1213 1.1605 1.0807 1.0700 1.0804 1.0547 1.0710 1.0834 1.0707 1.0857 1.0687 1.0586 1.0733 1.2271 1.1707 1.1874 1.5825 1.0902 1.7407 1.1812 1.0955 1.0740 1.0773 1.0683 1.0811 1.0696 1.0678 1.0753 1.2552 1.0699 1.1242 1.0771 1.0618 2.7932 4.2660 5.6363 6.1805 6.1585 6.1746 6.2860 1.1277 1.0692 1.0705 1.0582 1.0556 1.0604 1.0639 1.0541 1.0512 1.0737 1.0582 1.0369 1.0451 1.0402 1.0597 1.0403 1.0458 1.0513 1.0480 1.0487 1.0917 1.0999 1.1017 1.1025 1.0914 1.1005 1.0962 1.0864 1.0997 1.0927 1.0907 1.0888 1.0878 1.1019 1.0858 1.0999 1.0926 1.0797 1.0841 1.1003 1.0889 1.1015 1.0981 1.1043 1.1008 1.0966 1.1021 1.1010 1.0867 1.0993 1.0999 1.1027 1.0880 1.0859 1.0939 1.0888 1.0945 1.0982 1.0985 1.0915 1.0900
irintensity: 0.8091 0.9837 1.2790 0.0829 0.5862 0.9837 0.7390 0.8351 0.6521 1.2215 1.5412 0.7538 0.2282 4.0712 1.5289 5.2520 0.5574 0.6689 0.6223 0.1433 1.2783 0.9690 0.1999 0.4706 0.3364 0.3015 0.7379 7.7953 4.8310 0.7217 0.5619 2.6042 0.2641 2.0261 1.7638 3.5397 0.4859 2.7794 0.4197 0.2738 0.9667 3.2402 1.0156 1.4293 1.3074 0.0153 36.1881 0.2769 0.1622 3.9068 0.4027 0.2678 28.3428 2.0815 9.2273 3.9238 1.1417 5.0976 4.0673 1.0499 4.4292 0.0998 21.5018 3.5671 1.9946 9.2769 1.8294 8.0996 1.4338 2.3075 14.9542 2.1739 3.1261 1.4626 34.3517 6.0887 5.8478 5.8525 1.9733 3.2618 3.8091 2.9171 7.1137 6.9436 4.8263 5.1682 8.2246 2.5599 0.4748 6.4255 1.6109 6.7265 3.6823 1.0500 1.4695 9.8090 17.7412 3.9472 25.4921 7.5036 11.9149 6.3962 44.4242 26.5857 6.3997 2.1521 19.7852 19.6832 23.9051 68.8728 1.4656 14.8051 5.4200 6.3896 8.0130 1.5674 16.5759 9.7900 1.2710 0.3040 0.2935 14.7876 11.1373 3.3850 0.5104 5.5692 0.1501 4.1447 21.9489 3.3945 5.7045 3.6457 0.0944 0.0744 11.3037 4.2247 1.2655 14.5341 6.1269 9.5230 2.9135 16.2366 3.6459 30.0488 13.2244 13.9333 22.3697 6.6420 1.2363 2.1619 7.8656 13.0620 17.2444 7.7557 4.6816 5.2615 0.4753 0.7434 140.0295 17.3859 15.4177 0.2031 0.1883 11.4812 43.1425 4.0967 18.2703 1.4141 2.2825 23.7345 9.7997 9.7633 13.1831 5.1821 25.2601 55.5575 2.0605 1.3160 44.5901 4.7142 0.0420 2.0663 99.4290 58.5729 6.8843 1.5152 6.9895 5.1938 5.4307 38.8264 28.3198 26.8140 25.4508 14.3691 0.3880 8.7806 4.1656 4.1376 10.5500 1.4567 12.5642 5.9695 7.3032 15.1718 7.3604 31.0321 11.5247 29.0859 1.8677 2.8186 0.0994 1.2578 2.4114 5.4711 29.1617 20.3501 0.0779 1.0482 6.6072 6.1188 6.1732 3.3333 0.4023 3.9848 1.0460 7.3707 5.9293 0.2007 0.8687 2.5786 4.5424 0.5359 11.0926 23.3947 13.9619 12.6643 10.9814 12.9009 7.1955 24.1430 32.0496 8.5085 2.9001 12.3248 12.9516 109.6474 18.7475 23.7172 16.4449 0.6735 246.1618 27.0715 11.4541 2.4718 2.6221 5.6263 0.5082 1243.4245 5.0361 22.2431 29.6786 37.3541 48.0686 118.7573 74.3375 23.1770 79.7196 4.5286 35.3562 78.7162 47.1812 18.1064 35.7314 92.0418 14.5083 53.7480 49.9150 27.1265 43.5458 34.1780 73.4050 2.3988 25.9383 35.8693 15.8195 42.4652 9.0325 94.7671 23.2311 3.8582 35.0068 16.4862 22.2739 51.7516 2.3179 21.7342 59.9056 16.0332 19.7812 9.0508 10.2952 8.5153 29.6837 7.4263 0.9910 5.2357 4.8100 20.3393 1.1883 2.4012 4.7703 22.4246 3.4525 19.3298 31.8815 20.7218 2.4078 8.4673
temp: 298.150 k
press: 1.00000 atm
elementType: 6 6 6 6 6 6 6 6 1 1 1 1 1 16 5 7 6 6 1 1 1 6 1 1 1 6 1 1 1 6 6 6 6 6 1 1 1 1 1 1 6 1 1 1 6 1 1 1 6 1 1 1 6 1 1 1 7 7 7 7 6 1 1 1 6 6 1 1 6 1 1 6 1 1 1 6 1 1 6 1 1 6 1 1 1 1 1 1 6 1 1 1 6 6 6 6 6 6 6 6 1 1 1 1 1 1 16 3
symmnumber: 1
zpe: 2503373.9 jmol-1
zpe.correction: 0.953485 hartree
zpe.thermalcorrener: 1.003594 hartree
zpe.thermalcorrenthalpy: 1.004538 hartree
zpe.thermalcorrgfe: 0.872922 hartree
zpe.sumelectzpe: -2585.973077 hartree
zpe.sumelectthermal: -2585.922968 hartree
zpe.sumelectthermalent: -2585.922024 hartree
zpe.sumelectthermalfe: -2586.053640 hartree
dipole: 11.8133 6.9005 8.6100
dipole: 16.1648
quadrupole: -289.9045 -303.5551 -288.0018
quadrupole: -0.9743 1.6609 2.3620
quadrupole: 3.9160 -9.7347 5.8187 -0.9743 1.6609 2.3620
hfenergy: -2586.9265621 hartree
pointgroup: C01 [X(C38H61B1Li1N5S2)]
dipole: 4.556559 2.4095343 3.7253381 debye
polarizability: 530.3125645|4.126615|492.5314536|-22.352381|-7.1984177|462.4975326 unknown
InChI: InChI=1/C21H32BN2S.C9H23N3.C8H6S.Li/c1-19(2,3)23-22(18-15-16-11-8-9-12-17(16)25-18)24-20(4,5)13-10-14-21(24,6)7;1-10(2)6-8-12(5)9-7-11(3)4;1-2-4-8-7(3-1)5-6-9-8;/h8-9,11-12,15H,10,13-14H2,1-7H3;6-9H2,1-5H3;1-6H;/rC21H32BN2S.C9H23LiN3.C8H6S/c1-19(2,3)23-22(18-15-16-11-8-9-12-17(16)25-18)24-20(4,5)13-10-14-21(24,6)7;1-11(2)6-8-13(5)9-7-12(3,4)10(11)13;1-2-4-8-7(3-1)5-6-9-8/h8-9,11-12,15H,10,13-14H2,1-7H3;6-9H2,1-5H3;1-6H
charge 0 multiplicity 1
108 atoms
C  -0.49427693 2.18787439 -2.74825976
C  -1.09645926 2.77449353 -1.61067431
C  -0.87076663 4.13648478 -1.34693512
C  -0.05858247 4.87560322 -2.19301642
C  0.52781836 4.28105062 -3.32198256
C  0.31015414 2.94064285 -3.6083206
C  -1.77132323 0.52275006 -1.3309222
C  -1.82854367 1.79904937 -0.84814196
H  -1.33591052 4.60361204 -0.48198875
H  0.11613545 5.92814245 -1.99047404
H  1.15249078 4.87692207 -3.98031487
H  0.76733279 2.48029784 -4.4793025
H  -2.41202573 2.04031699 0.03327834
S  -0.84889078 0.48096303 -2.82315238
B  -2.38190958 -0.86068919 -0.74565478
N  -1.75422809 -1.95886342 -1.26017073
C  -2.01521204 -3.38008058 -1.15696352
C  -1.49012492 -4.03154839 -2.45270779
H  -2.00510083 -3.59902956 -3.31610067
H  -0.41928956 -3.83041418 -2.56822173
H  -1.64322018 -5.11839609 -2.45823183
C  -1.25960652 -4.01814794 0.02707994
H  -1.62564719 -3.62780743 0.98156204
H  -1.39503613 -5.10641007 0.03859546
H  -0.18658657 -3.81519946 -0.04251497
C  -3.50505986 -3.73205451 -1.01721852
H  -3.90207844 -3.35126427 -0.07526437
H  -4.0756032 -3.27732824 -1.83430109
H  -3.66283432 -4.81721684 -1.05054776
C  -4.81964683 -0.27047395 -0.032802
C  -3.03920247 -0.68668953 1.73469458
C  -5.22512586 1.02336864 0.70649558
C  -3.51321887 0.59930708 2.45577912
C  -4.97978364 0.93108267 2.20813956
H  -6.27900512 1.24707744 0.50135624
H  -4.63772664 1.8563582 0.29902385
H  -3.31159789 0.50704896 3.53203591
H  -2.91254178 1.43973667 2.08571337
H  -5.23765947 1.87696544 2.69849122
H  -5.62771081 0.16763877 2.65566658
C  -3.54217776 -1.91899879 2.52719532
H  -4.61410747 -1.8786717 2.72742305
H  -3.34134194 -2.83365797 1.96597366
H  -3.03653703 -1.98867557 3.49848565
C  -1.49800658 -0.70422945 1.84772328
H  -1.05483883 0.12992183 1.29257706
H  -1.22578731 -0.60577129 2.90662009
H  -1.07653885 -1.63364095 1.45796746
C  -5.87963195 -1.36048509 0.26322095
H  -5.6620371 -2.26543733 -0.30523037
H  -5.93321109 -1.63290656 1.31787185
H  -6.87379269 -1.00562443 -0.03261304
C  -4.90962068 0.00365183 -1.54249737
H  -4.29070747 0.85253998 -1.8397367
H  -4.59193971 -0.87010187 -2.12004315
H  -5.94735955 0.22799225 -1.80979357
N  -3.44558328 -0.68357946 0.32150724
N  2.19153311 -0.19543798 3.19716863
N  3.0835286 1.69241496 0.22397711
N  1.05701325 2.35926262 2.1923048
C  -0.37059484 2.66426047 2.30036046
H  -0.53867696 3.65679848 2.74960621
H  -0.86997586 1.91610637 2.91769556
H  -0.824419 2.63485873 1.30992873
C  1.49586655 0.78245491 4.04783225
C  1.63671197 2.20874774 3.53426548
H  1.15601874 2.89673105 4.24727273
H  2.69160295 2.49028289 3.50807852
C  1.72940658 3.40804132 1.41353158
H  1.82839649 4.33886215 1.99707081
H  1.09394182 3.64398117 0.55464118
C  3.64599958 -0.05850925 3.31477925
H  4.13528507 -0.76591782 2.64396963
H  3.99161135 -0.24092592 4.34567352
H  3.96294096 0.94170672 3.015364
C  3.1077105 2.97709187 0.92883008
H  3.51137099 3.77317894 0.27946464
H  3.80196483 2.88317576 1.77189228
C  2.29491763 1.79726087 -1.01184377
H  1.23305665 1.9256259 -0.78424408
H  2.39643891 0.87957362 -1.59178955
C  4.45163666 1.2672716 -0.07352781
H  5.01576081 1.15279526 0.85642604
H  4.97427449 1.998394 -0.71152971
H  4.4396146 0.30409476 -0.58422002
H  1.86436543 0.72764956 5.08671956
H  0.43685469 0.50643277 4.06737327
H  2.60631528 2.64915744 -1.63550994
C  1.79234495 -1.54946572 3.59144137
H  2.34940369 -2.28566766 3.00908288
H  1.9916838 -1.73700637 4.65883061
H  0.72645599 -1.69539844 3.40050321
C  3.69087837 -1.96222659 -1.56898857
C  3.36858052 -2.1626907 -0.20840623
C  4.40094132 -2.49577131 0.68353162
C  5.70865901 -2.55855049 0.23367746
C  6.01537235 -2.31145869 -1.11359047
C  5.01105222 -2.02599228 -2.02490708
C  1.24577044 -1.72539089 -1.10558834
C  1.95140462 -2.00163405 0.02476971
H  4.17093046 -2.73147816 1.71841091
H  6.50439792 -2.81691865 0.92514414
H  7.04577073 -2.36499314 -1.44944283
H  5.24357012 -1.8584917 -3.07175932
H  0.13873223 -1.6790997 -1.22585376
H  1.46136163 -2.19647415 0.97288035
S  2.25854194 -1.63057587 -2.5105717
Li 1.69959469 0.47877672 1.23278365
