program: Gaussian 16
title: Li-PMDETA-benzothiophene dimer
version: ES64L-G16RevC.01
frameworkgroup: C1[X(C34H56Li2N6S2)]
method: RwB97XD
basis: Gen
operation: Freq
keyword: #P
keyword: Geom=AllCheck
keyword: Guess=TCheck
keyword: SCRF=Check
keyword: GenChk
keyword: RwB97XD/ChkBas
keyword: Freq
converged: YES YES NO NO
title: Mulliken charges:
elementType: N N N C H H H C C H H C H H C H H H C H H C H H C H H H H H H C H H H C C C C C C C C H H H H H S N N N C H H H C C H H C H H C H H H C H H C H H C H H H H H H C H H H C C C C C C C C H H H H H S Li Li
charge: -0.462489 -0.489690 -0.445364 -0.196996 0.131262 0.156830 0.168669 -0.060416 -0.064226 0.135133 0.128834 -0.078470 0.138969 0.150784 -0.176121 0.172023 0.135271 0.112107 -0.067967 0.138209 0.131239 -0.185694 0.155632 0.153320 -0.183975 0.148295 0.140873 0.135037 0.132613 0.136181 0.130349 -0.195712 0.170079 0.132245 0.142169 -0.223632 0.120049 -0.166366 -0.134831 -0.135308 -0.116312 -0.306834 -0.173775 0.104268 0.107262 0.108463 0.129678 0.079871 0.067110 -0.457494 -0.483960 -0.441014 -0.196810 0.129002 0.161989 0.167129 -0.060811 -0.075343 0.138539 0.128500 -0.083808 0.134783 0.146825 -0.173406 0.156303 0.136845 0.117990 -0.055277 0.136764 0.120580 -0.206861 0.138893 0.182841 -0.177895 0.127392 0.136756 0.162859 0.130856 0.157526 0.127400 -0.195524 0.138322 0.138619 0.167321 -0.216673 0.110197 -0.155644 -0.135853 -0.134473 -0.118501 -0.294190 -0.195182 0.096903 0.106466 0.108356 0.130260 0.067492 0.077393 -0.118838 -0.132195
chargesum: -0.00000
title: Mulliken charges with hydrogens summed into heavy atoms:
elementType: N N N C C C C C C C C C C C C C C C C C S N N N C C C C C C C C C C C C C C C C C S Li Li
charge: -0.462489 -0.489690 -0.445364 0.259766 0.208378 0.199740 0.211283 0.243279 0.201482 0.253608 0.240229 0.248781 -0.223632 0.120049 -0.062098 -0.027569 -0.026845 0.013366 -0.306834 -0.093903 0.067110 -0.457494 -0.483960 -0.441014 0.261310 0.227572 0.191696 0.197800 0.237732 0.202066 0.242273 0.249112 0.248739 -0.216673 0.110197 -0.058741 -0.029388 -0.026117 0.011759 -0.294190 -0.127690 0.077393 -0.118838 -0.132195
chargesum: 0.00000
polarizability: 5.50724508e+02 -2.39436137e+01 4.25958110e+02 -2.48395946e+01 -3.64409324e+01 4.08572355e+02
1716.lowfreq: -0.7473 -0.0016 -0.0009 0.0011 2.4985 6.2378 10.0472 20.9284 26.7193
redmass: 5.3621 4.8576 4.7666 3.7607 4.9421 4.4596 4.2822 4.7494 4.6817 3.8688 4.4294 5.0245 4.4932 4.3329 4.1407 3.9997 3.4668 4.8148 3.8862 3.2402 3.9861 3.3171 4.0898 3.1232 3.0333 3.0540 2.5547 2.7460 2.8011 2.9039 2.2558 4.4458 2.6013 2.7746 1.7065 3.8206 3.0784 1.3122 1.1562 1.6114 1.1434 1.1748 1.3617 1.1575 1.6932 3.7373 1.3484 1.5576 5.1750 1.7156 2.2465 2.6247 5.4687 3.6179 2.3708 2.5791 2.7302 2.6755 2.4206 1.9491 2.2978 3.0092 2.1084 2.4116 2.5461 2.6950 2.5968 2.2041 2.2825 2.1257 3.1363 2.3372 2.2933 4.2348 3.7218 2.3117 8.1041 8.3097 6.1506 6.2092 7.8412 7.7426 2.5264 2.6326 3.6076 3.6343 2.9054 2.9264 8.4869 8.5370 6.5691 6.5630 2.5524 2.6094 1.4541 1.4755 2.1928 8.6050 2.8856 4.5076 2.5232 2.4543 2.8536 2.3880 1.6024 1.2914 1.4208 1.4612 4.5402 4.7420 1.9284 1.9193 1.3596 1.3579 2.2545 2.2520 2.2275 2.2005 1.2606 1.2559 2.1538 2.1475 2.1821 2.1584 2.0739 1.9193 1.9397 1.8318 1.5545 1.8814 1.7417 1.5526 1.5258 1.4945 4.6163 4.2618 1.8565 1.9406 1.8111 1.8392 1.2848 1.3076 1.2952 1.2789 1.3908 1.4058 1.4659 1.4839 1.7179 1.7884 1.1811 1.1783 1.4463 1.4276 1.6489 1.6851 1.2505 1.2444 1.8117 1.8521 2.5368 2.4442 2.8262 2.9043 2.1838 2.1696 1.7815 1.8592 1.8481 1.7337 2.2171 2.2478 1.6380 1.6230 1.3627 1.4025 1.6115 1.5937 1.5718 1.5546 6.2929 6.3130 1.4304 1.4369 1.3812 1.3852 1.4687 1.4686 1.4265 1.4472 1.1759 1.1727 2.6127 1.6359 1.2217 1.8870 1.1686 1.1554 1.1014 1.1128 1.1538 1.1584 1.0652 1.0743 1.0833 1.0791 1.0888 1.0833 1.1043 1.1097 1.0781 1.4669 2.0614 1.5155 1.0720 1.0962 1.1054 1.0862 1.0693 1.0695 1.0776 1.0921 1.0726 1.0703 1.0661 1.0923 1.0948 1.0786 1.1115 1.2559 1.9657 2.2392 1.1336 1.2079 6.0601 6.0742 6.1821 6.1666 1.0705 1.0700 1.0684 1.0624 1.0544 1.0576 1.0598 1.0623 1.0622 1.0670 1.0612 1.0589 1.0580 1.0669 1.0603 1.0584 1.0702 1.0740 1.0888 1.0893 1.0899 1.0845 1.0858 1.0865 1.0896 1.0901 1.0785 1.0805 1.0815 1.0795 1.0820 1.0807 1.0785 1.0854 1.0796 1.0840 1.1016 1.1043 1.1034 1.1027 1.1034 1.1027 1.1028 1.0913 1.0992 1.0972 1.0863 1.0856 1.0882 1.0879 1.0883 1.0938 1.0943 1.0974 1.0984 1.0982
irintensity: 1.3254 0.5157 0.2257 0.1882 0.6884 0.6315 0.3269 0.1365 0.4369 0.6282 4.4591 1.0391 0.7222 1.6720 4.1621 1.3047 0.5946 2.5783 2.2393 0.4747 4.9292 0.8671 6.4787 0.5234 1.2710 0.0472 3.1911 0.4002 0.7186 1.4207 0.3072 0.1226 0.4407 1.3617 0.2878 0.5745 1.6457 0.2875 0.7078 6.4325 0.3024 1.1973 1.6847 0.1040 1.5380 70.1902 0.2597 2.0588 46.0475 2.1206 2.5864 1.1991 1.1973 1.2587 2.4567 1.9877 7.6972 5.7057 8.4262 0.3942 2.6607 23.1423 6.2068 3.3577 5.9736 4.5021 5.5776 1.3194 16.7433 11.2067 18.0577 8.5952 4.2106 64.9922 25.1408 8.9395 4.5804 4.6269 34.0338 15.3939 24.3517 3.9455 8.5147 4.4388 15.7913 2.4548 6.4293 5.0772 6.2179 0.2848 2.3014 2.8182 15.3707 14.8268 21.2884 26.8851 6.6679 18.2283 27.0252 67.9406 18.1146 18.1260 10.8115 51.1637 16.4433 26.6840 4.4989 5.7709 0.6519 15.5569 10.6001 9.7918 4.2435 4.8531 17.8470 26.7498 10.3501 9.4768 0.1875 0.5647 21.3465 18.7827 8.6825 9.8380 18.1013 4.5803 13.3138 9.2503 9.6820 5.3338 10.0873 8.3720 11.1472 1.3565 16.4260 18.0352 24.0440 24.8146 7.4252 9.1068 1.2479 2.0031 0.4641 2.3650 4.0926 9.7313 2.9219 4.9320 28.2123 31.5076 3.8754 2.7575 19.5857 15.1506 31.3905 39.9950 0.8912 2.6154 8.3558 6.5298 8.9380 10.9194 4.5922 2.2140 0.5969 0.2718 2.1432 8.3555 1.6408 6.7560 4.8038 10.2289 1.7248 5.6933 5.7991 1.8729 22.6022 28.1729 23.9402 18.2997 5.9758 10.7594 8.0562 12.3271 8.4833 34.1027 11.6141 5.9452 2.0542 1.6385 0.3072 0.2191 19.7470 0.5882 1.0880 18.2118 0.2322 0.9050 1.8092 1.7273 1.4709 3.1166 2.9074 5.4991 10.1726 4.2318 2.4987 9.4443 4.2465 3.8875 55.6399 22.4558 14.7529 1.4366 14.9835 4.6921 22.7496 33.7913 10.8024 8.4129 27.1826 14.5106 15.1264 14.1864 12.9364 30.5116 9.0574 38.2759 10.6550 38.7499 5.6525 3.8649 8.5128 20.6479 1.4386 1.2156 5.3944 2.5099 2.9561 0.1998 15.1380 26.6319 45.1946 12.8327 45.8630 62.0065 98.8354 10.5451 98.8960 4.7903 160.9484 294.9873 97.7684 40.6735 203.9445 133.2521 12.9287 6.5525 0.4647 17.1174 14.5942 16.3500 15.7001 22.5006 16.4311 25.5213 29.0462 14.9081 10.9892 8.6855 12.1166 27.6534 39.3610 49.8036 11.2939 13.9894 10.3819 10.3863 8.2864 6.4190 1.5655 33.5515 3.5046 12.8106 8.5824 8.9456 11.3813 12.5979 3.9819 34.0605 38.4659 4.6842 68.4047 12.2973
temp: 298.150 k
press: 1.00000 atm
elementType: 7 7 7 6 1 1 1 6 6 1 1 6 1 1 6 1 1 1 6 1 1 6 1 1 6 1 1 1 1 1 1 6 1 1 1 6 6 6 6 6 6 6 6 1 1 1 1 1 16 7 7 7 6 1 1 1 6 6 1 1 6 1 1 6 1 1 1 6 1 1 6 1 1 6 1 1 1 1 1 1 6 1 1 1 6 6 6 6 6 6 6 6 1 1 1 1 1 16 3 3
symmnumber: 1
zpe: 2300434.0 jmol-1
zpe.correction: 0.876189 hartree
zpe.thermalcorrener: 0.924944 hartree
zpe.thermalcorrenthalpy: 0.925889 hartree
zpe.thermalcorrgfe: 0.793049 hartree
zpe.sumelectzpe: -2468.017634 hartree
zpe.sumelectthermal: -2467.968879 hartree
zpe.sumelectthermalent: -2467.967935 hartree
zpe.sumelectthermalfe: -2468.100774 hartree
dipole: 0.4545 0.2238 -1.1327
dipole: 1.2409
quadrupole: -273.8272 -257.9027 -266.3103
quadrupole: 35.2895 -2.9460 2.0901
quadrupole: -7.8139 8.1107 -0.2969 35.2895 -2.9460 2.0901
hfenergy: -2468.8938233 hartree
pointgroup: C01 [X(C34H56Li2N6S2)]
dipole: 0.0872619 0.1020084 -0.4693821 debye
polarizability: 508.9367656|67.1407276|449.5337876|2.0009071|-47.1152382|426.7844203 unknown
InChI: InChI=1/2C9H23N3.2C8H5S.2Li/c2*1-10(2)6-8-12(5)9-7-11(3)4;2*1-2-4-8-7(3-1)5-6-9-8;;/h2*6-9H2,1-5H3;2*1-5H;;/r2C17H28LiN3S/c2*1-19(2)10-12-21(5)13-11-20(3,4)18(19,21)17-14-15-8-6-7-9-16(15)22-17/h2*6-9,14H,10-13H2,1-5H3
charge 0 multiplicity 1
100 atoms
N  -0.14965498 2.99844518 1.42760457
N  -0.18300016 2.94046292 -2.33665686
N  -2.16561045 3.93897078 -0.44559376
C  -3.52909311 3.62207975 -0.03253722
H  -4.16864709 4.52114439 0.01141252
H  -3.52236971 3.14494 0.94965902
H  -3.96359534 2.89873996 -0.7248206
C  -1.04260991 4.11080143 1.74968856
C  -1.51390728 4.84587423 0.49925233
H  -2.18646443 5.67166513 0.79149418
H  -0.6526082 5.307765 0.00973903
C  -2.1172866 4.43045804 -1.81931848
H  -2.43894098 5.48466666 -1.89714803
H  -2.83245469 3.84550823 -2.40495895
C  1.20534283 3.45237915 1.12116735
H  1.81666694 2.59930941 0.82108106
H  1.68282695 3.94275076 1.98677303
H  1.1883234 4.16352056 0.28982845
C  -0.72456183 4.29673747 -2.43057873
H  -0.76471905 4.63890566 -3.48095807
H  -0.02445901 4.96433489 -1.91704161
C  -0.87666638 2.02016744 -3.23758109
H  -1.93581472 1.95679715 -2.98228157
H  -0.46097641 1.01765056 -3.11730967
C  1.24381417 2.95300693 -2.64141877
H  1.78811556 3.5392462 -1.89646934
H  1.4496814 3.3701353 -3.6429838
H  1.63028059 1.93467202 -2.60429417
H  -0.56427397 4.82964716 2.43825973
H  -1.90946358 3.70174184 2.27649981
H  -0.7787542 2.32957418 -4.29315482
C  -0.12369218 2.02066822 2.51339864
H  0.47699809 1.16150808 2.20994028
H  0.30505099 2.44395803 3.43832579
H  -1.14186547 1.6783516 2.713198
C  -4.26877764 -0.94820239 -0.17099111
C  -3.44637253 -1.07944166 0.96935953
C  -3.89436901 -1.88780577 2.02828729
C  -5.10308556 -2.55815472 1.9260423
C  -5.89553553 -2.43307601 0.7748834
C  -5.48578583 -1.62518757 -0.27665977
C  -2.06187996 0.42070135 -0.31318561
C  -2.22455458 -0.31505236 0.83552159
H  -3.29778629 -1.97356454 2.93369775
H  -5.44593001 -3.18099793 2.74712568
H  -6.84048527 -2.96382214 0.71024616
H  -6.10317437 -1.51816618 -1.16389828
H  -1.47037653 -0.31119888 1.61911
S  -3.48638804 0.12582455 -1.31368346
N  0.26205203 -3.19752094 2.25160154
N  -0.30848057 -3.03941173 -1.24731946
N  2.21479444 -3.68556283 0.05686465
C  3.58386376 -3.18197778 0.10941414
H  4.31947618 -3.96650636 -0.14103686
H  3.8036347 -2.79824008 1.10711684
H  3.6922331 -2.34024762 -0.57825801
C  1.51917589 -3.93331905 2.41680766
C  1.95724129 -4.63989265 1.13570223
H  2.85104558 -5.24951434 1.35092046
H  1.18142774 -5.34220221 0.81922752
C  1.90008337 -4.20560382 -1.27014428
H  2.34452839 -5.20239764 -1.44403877
H  2.36182873 -3.53391122 -2.00000337
C  -0.89016238 -4.08763067 2.15257206
H  -1.79056838 -3.50156101 1.95454625
H  -1.04063866 -4.671491 3.07783434
H  -0.76488363 -4.78693595 1.32341235
C  0.39873144 -4.28640498 -1.53118595
H  0.24078319 -4.60825865 -2.57728414
H  -0.04756626 -5.06432023 -0.90121163
C  0.0416403 -1.97532318 -2.18933798
H  1.11300461 -1.76618283 -2.14029417
H  -0.49201419 -1.06506659 -1.89728782
C  -1.75154449 -3.2649782 -1.27372951
H  -2.03183179 -3.99964413 -0.51475341
H  -2.0895819 -3.63075482 -2.25889586
H  -2.2689651 -2.33323325 -1.05471393
H  1.44411664 -4.67019986 3.2371477
H  2.28734719 -3.20705229 2.70243079
H  -0.22635685 -2.24054289 -3.22729966
C  0.07157725 -2.25335058 3.35024125
H  -0.86425943 -1.70957119 3.20217243
H  0.02897287 -2.76131394 4.32936668
H  0.88745994 -1.52671995 3.35984749
C  4.03426233 0.94179001 1.04372955
C  3.57826692 1.0249756 -0.28987146
C  4.31430098 1.80195043 -1.20115844
C  5.44876782 2.47606793 -0.77851707
C  5.87850568 2.3911439 0.55459319
C  5.17619328 1.62251655 1.47172429
C  1.8611698 -0.41975219 0.60024244
C  2.36407915 0.25828403 -0.48249165
H  3.9975514 1.86558072 -2.23909588
H  6.0155142 3.07417724 -1.48617381
H  6.76975627 2.92548497 0.86921152
H  5.51002365 1.54949657 2.50274895
H  1.88004776 0.20783055 -1.45582378
S  2.94800485 -0.09094405 1.95063059
Li -0.87612002 2.14996586 -0.39379721
Li 0.6349609 -2.12737474 0.4693919
