program: Gaussian 16
title: displacement calc 3.0
version: ES64L-G16RevC.01
frameworkgroup: C1[X(C47H83BN8Na2S2)]
method: RwB97XD
basis: Gen
operation: Freq
keyword: #P
keyword: Geom=AllCheck
keyword: Guess=TCheck
keyword: SCRF=Check
keyword: GenChk
keyword: RwB97XD/ChkBasFreq
converged: YES YES NO YES
title: Mulliken charges:
elementType: N N N C H H H C C H H C H H C H H H C H H C H H C H H H Na H H H C H H H C C C C C C C C H H H H H S N N N C H H H C C H H C H H C H H H C H H C H H C H H H Na H H H C H H H C C C C C C C C H H H H H S C C C C C H H H H H H C H H H C H H H C H H H C H H H N B N C C H H H C H H H C H H H
charge: -0.570763 -0.493122 -0.628831 -0.193273 0.124789 0.161693 0.156633 -0.052882 -0.075645 0.130309 0.121271 -0.029495 0.126661 0.113656 -0.190748 0.154910 0.127518 0.129264 -0.071728 0.133577 0.129726 -0.196568 0.122887 0.132735 -0.201997 0.132109 0.111030 0.132522 0.250944 0.117103 0.146479 0.108952 -0.182640 0.154554 0.121082 0.143561 -0.215659 0.112187 -0.150510 -0.133892 -0.132727 -0.114695 -0.377083 -0.197969 0.108280 0.110707 0.112609 0.133305 0.064701 0.144824 -0.553322 -0.568830 -0.667157 -0.192559 0.136749 0.147377 0.158538 -0.062721 -0.068920 0.133299 0.128859 -0.072949 0.137110 0.151452 -0.185319 0.170677 0.129672 0.119315 -0.058316 0.133350 0.114830 -0.199080 0.124640 0.174573 -0.206034 0.123036 0.134996 0.181906 0.420375 0.129317 0.130495 0.134446 -0.202224 0.144386 0.139225 0.136236 -0.228802 0.103419 -0.165966 -0.134290 -0.134568 -0.119788 -0.353733 -0.215747 0.124441 0.115763 0.116005 0.137112 0.137128 0.127807 -0.195650 0.138752 0.146765 -0.198550 -0.228888 0.117383 0.101249 0.103482 0.112056 0.109272 0.112738 -0.361847 0.109849 0.144669 0.119646 -0.318653 0.167725 0.102855 0.107044 -0.322277 0.102618 0.163815 0.111973 -0.362260 0.139935 0.117668 0.130310 -0.758219 0.825853 -0.693824 0.144684 -0.331364 0.144910 0.097531 0.109368 -0.334094 0.116896 0.100921 0.105151 -0.334424 0.123432 0.148547 0.096398
chargesum: -0.00000
title: Mulliken charges with hydrogens summed into heavy atoms:
elementType: N N N C C C C C C C C Na C C C C C C C C C S N N N C C C C C C C C Na C C C C C C C C C S C C C C C C C C C N B N C C C C
charge: -0.570763 -0.493122 -0.628831 0.249841 0.210700 0.175935 0.210822 0.220944 0.191575 0.168006 0.173664 0.250944 0.236556 -0.215659 0.112187 -0.042230 -0.023186 -0.020119 0.018609 -0.377083 -0.133267 0.144824 -0.553322 -0.568830 -0.667157 0.250105 0.197091 0.193237 0.215613 0.234346 0.189863 0.234580 0.233904 0.420375 0.217623 -0.228802 0.103419 -0.041526 -0.018527 -0.018563 0.017324 -0.353733 -0.078620 0.127807 0.022982 0.138752 0.146765 0.016987 -0.006878 0.012317 0.058971 0.056129 0.025653 -0.758219 0.825853 -0.693824 0.144684 0.020445 -0.011125 0.033954
chargesum: -0.00001
polarizability: 6.25776837e+02 -1.95263906e+01 7.06614471e+02 -2.70649301e+00 1.79738743e+01 5.72490654e+02
1716.lowfreq: -193.0700 -3.4560 -1.7164 -0.6868 -0.0011 -0.0008 0.0023 14.0113 15.5076
temp: 298.150 k
press: 1.00000 atm
elementType: 7 7 7 6 1 1 1 6 6 1 1 6 1 1 6 1 1 1 6 1 1 6 1 1 6 1 1 1 11 1 1 1 6 1 1 1 6 6 6 6 6 6 6 6 1 1 1 1 1 16 7 7 7 6 1 1 1 6 6 1 1 6 1 1 6 1 1 1 6 1 1 6 1 1 6 1 1 1 11 1 1 1 6 1 1 1 6 6 6 6 6 6 6 6 1 1 1 1 1 16 6 6 6 6 6 1 1 1 1 1 1 6 1 1 1 6 1 1 1 6 1 1 1 6 1 1 1 7 5 7 6 6 1 1 1 6 1 1 1 6 1 1 1
symmnumber: 1
zpe: 3332526.9 jmol-1
zpe.correction: 1.269292 hartree
zpe.thermalcorrener: 1.339160 hartree
zpe.thermalcorrenthalpy: 1.340105 hartree
zpe.thermalcorrgfe: 1.163493 hartree
zpe.sumelectzpe: -3423.019084 hartree
zpe.sumelectthermal: -3422.949216 hartree
zpe.sumelectthermalent: -3422.948272 hartree
zpe.sumelectthermalfe: -3423.124884 hartree
dipole: 4.8769 -1.7985 -2.9437
dipole: 5.9736
quadrupole: -351.6257 -395.4041 -375.3986
quadrupole: -7.1205 -3.1029 -9.5634
quadrupole: 22.5171 -21.2613 -1.2558 -7.1205 -3.1029 -9.5634
hfenergy: -3424.2883767 hartree
pointgroup: C01 [X(C47H83B1N8Na2S2)]
dipole: -1.8900364 -0.553747 1.2824255 debye
polarizability: 626.5286275|20.4062205|701.5854365|-6.9811993|-29.3068561|576.7678973 unknown
InChI: InChI=1/C13H27BN2.2C9H23N3.2C8H5S.2Na/c1-11(2,3)15-14-16-12(4,5)9-8-10-13(16,6)7;2*1-10(2)6-8-12(5)9-7-11(3)4;2*1-2-4-8-7(3-1)5-6-9-8;;/h8-10H2,1-7H3;2*6-9H2,1-5H3;2*1-5H;;/q-1;;;;;;+1/rC30H55BN5NaS.C17H28N3NaS/c1-28(2,3)35(31-34-29(4,5)18-15-19-30(34,6)7)37(27-24-25-16-13-14-17-26(25)38-27)36(11,12)23-22-33(10)21-20-32(8)9;1-18(2)10-11-20(5)13-12-19(3,4)21(20)17-14-15-8-6-7-9-16(15)22-17/h13-14,16-17,24H,15,18-23H2,1-12H3;6-9,14H,10-13H2,1-5H3
charge 0 multiplicity 1
143 atoms
N  0.34326306 1.26326231 2.66118153
N  5.80584275 3.64853333 0.40145444
N  2.06103855 2.95160254 0.94487285
C  1.44887182 3.8845287 0.00295731
H  1.76568696 4.92887774 0.16068281
H  0.36152988 3.84491437 0.09643103
H  1.70120881 3.59609197 -1.01960338
C  0.42420093 2.71419945 2.79449126
C  1.75762134 3.29548861 2.3298044
H  1.72372847 4.38745468 2.48490876
H  2.5640863 2.92348204 2.96963895
C  3.47865018 2.70388964 0.69372051
H  3.55251279 2.14715915 -0.24406687
H  3.83402936 2.02588171 1.47552189
C  1.32848945 0.56429364 3.47282391
H  1.18524212 -0.51296295 3.36531311
H  1.25092626 0.82343312 4.54548558
H  2.34169124 0.7949496 3.1342146
C  4.39502073 3.93770385 0.63462733
H  4.06204736 4.60664193 -0.16695667
H  4.31592211 4.50429576 1.5716475
C  6.44861719 2.92685863 1.48340883
H  6.23251791 3.42094834 2.43578003
H  7.53318792 2.94177409 1.33509488
C  6.07002321 3.03603136 -0.8883877
H  5.56709862 3.60379548 -1.67707914
H  5.73982612 1.98326732 -0.96252402
H  7.14616684 3.05899145 -1.08795462
Na 0.6694472 0.80427391 0.19147709
H  0.25399221 3.02967962 3.84331803
H  -0.38222699 3.14125309 2.18976987
H  6.13904017 1.86885216 1.56463636
C  -1.00049305 0.80190829 2.9681086
H  -1.05773114 -0.28088931 2.82025412
H  -1.29676673 1.02833298 4.01025223
H  -1.70772005 1.28765851 2.29073013
C  -1.60978031 3.87213106 -2.11545059
C  -2.08421501 4.23136801 -0.83725403
C  -2.4298042 5.57143033 -0.59609468
C  -2.30011306 6.50717986 -1.60888135
C  -1.82573502 6.13226785 -2.87609184
C  -1.4770447 4.81560992 -3.13823089
C  -1.69267972 1.88109655 -0.44324491
C  -2.10826222 3.09180276 0.05463796
H  -2.794325 5.86788636 0.38427342
H  -2.56614352 7.54351505 -1.42334491
H  -1.72937103 6.87999039 -3.65731866
H  -1.10679959 4.52372074 -4.11657489
H  -2.43349432 3.21204319 1.0875873
S  -1.23700546 2.1629588 -2.1241984
N  -4.62969811 0.94129114 1.99154051
N  -4.22788955 -0.52868757 -1.86253871
N  -4.71011393 -1.82000678 0.79933348
C  -4.12077682 -2.80473796 1.7025544
H  -4.84940781 -3.57436181 2.01255317
H  -3.73382346 -2.31538705 2.60072187
H  -3.28468247 -3.29992734 1.21284711
C  -5.48156002 -0.13970971 2.48479665
C  -5.85821159 -1.17071396 1.42767811
H  -6.51755089 -1.92043946 1.90249993
H  -6.45916973 -0.68348416 0.6576387
C  -5.0680879 -2.44141539 -0.47812174
H  -5.95729733 -3.09033099 -0.37383595
H  -4.24149406 -3.09849291 -0.76391387
C  -5.28408127 1.70397872 0.93128238
H  -4.63711925 2.52702421 0.6229416
H  -6.26187239 2.10782557 1.25145369
H  -5.43407186 1.07326339 0.05328731
C  -5.34111663 -1.43466804 -1.59555906
H  -5.62347229 -2.00255435 -2.50223963
H  -6.21259369 -0.82165147 -1.34189187
C  -3.1320135 -1.21084541 -2.54446328
H  -2.75505798 -2.03095699 -1.93109847
H  -2.31056143 -0.50854502 -2.70723743
C  -4.66486473 0.61611649 -2.655751
H  -5.46299617 1.15304882 -2.13510116
H  -5.04352556 0.31263341 -3.6481889
H  -3.82674113 1.30298805 -2.79333588
Na -2.87438114 -0.16390119 0.3025393
H  -6.4239391 0.2637557 2.90400992
H  -4.95575537 -0.62621501 3.31334413
H  -3.44402592 -1.62098416 -3.52218749
C  -4.29200014 1.82461994 3.10148708
H  -3.62804721 2.62099259 2.75781634
H  -5.18887491 2.29158322 3.54707983
H  -3.77289386 1.26179089 3.88203642
C  -0.8521344 -3.9113028 1.21810259
C  -1.07486346 -3.55319468 -0.13047993
C  -1.85085709 -4.40950393 -0.93173592
C  -2.40212719 -5.55854844 -0.3843856
C  -2.18252743 -5.88817971 0.96216288
C  -1.40149847 -5.07169881 1.76856385
C  0.3828133 -1.74095197 0.50469723
C  -0.39302804 -2.32300462 -0.47182665
H  -2.0024891 -4.17837603 -1.98331951
H  -2.99887411 -6.21885454 -1.00648368
H  -2.61550343 -6.79522892 1.37214458
H  -1.21826724 -5.33203981 2.80676728
H  -0.40089191 -1.92033496 -1.48261654
S  0.17741644 -2.71034485 1.96258263
C  5.6237697 -2.52918666 0.14284794
C  4.23696839 -2.0844483 0.6411887
C  3.1691759 -3.76824931 -0.98569362
C  4.5921648 -4.1779746 -1.41730764
C  5.64263065 -3.97862282 -0.33047761
H  5.91105846 -1.87868662 -0.69384051
H  6.35580522 -2.37254979 0.94414434
H  4.56953838 -5.22357544 -1.74602601
H  4.87303002 -3.57241622 -2.28894864
H  5.46022542 -4.65891478 0.50989465
H  6.63430295 -4.23259576 -0.71974628
C  2.29177352 -3.7583364 -2.24380397
H  2.30874094 -4.7541086 -2.69672946
H  1.2546215 -3.51232194 -2.00671652
H  2.66113659 -3.0469351 -2.98481908
C  2.56776981 -4.81640271 -0.03047566
H  1.6122982 -4.46696454 0.36263694
H  2.39434533 -5.74979538 -0.57589897
H  3.21689511 -5.05035647 0.8134952
C  3.92127863 -2.72030677 2.00966868
H  4.57185357 -2.28308317 2.77483724
H  2.88088978 -2.53259807 2.28171768
H  4.08135671 -3.79825951 2.02971391
C  4.2699415 -0.56946874 0.86177808
H  3.31027649 -0.21004176 1.24699859
H  5.04410066 -0.32792552 1.59754768
H  4.49081058 -0.02829249 -0.06101162
N  3.2185708 -2.40268598 -0.39506907
B  2.34575903 -1.38373311 -0.82296456
N  1.96600575 -0.35242949 -1.54174618
C  2.51593357 0.10549924 -2.81356789
C  2.528444 1.64000971 -2.85505041
H  1.53666245 2.03021547 -2.61117128
H  3.25506039 2.04404917 -2.14375893
H  2.80709219 2.00083604 -3.85176229
C  3.94990842 -0.38576599 -3.08272251
H  4.01108182 -1.47695224 -3.0988951
H  4.31613773 -0.01012681 -4.04460993
H  4.62952547 -0.02918846 -2.30055345
C  1.57698681 -0.38605605 -3.92961413
H  1.52362096 -1.47822783 -3.93970666
H  0.56828625 0.00132364 -3.75505507
H  1.91723508 -0.04572913 -4.91453637
