program: Gaussian 16
title: displacement calc 3.0
version: ES64L-G16RevC.01
frameworkgroup: C1[X(C34H56N6Na2S2)]
method: RwB97XD
basis: Gen
operation: Freq
keyword: #P
keyword: Geom=AllCheck
keyword: Guess=TCheck
keyword: SCRF=Check
keyword: GenChk
keyword: RwB97XD/ChkBas
keyword: Freq
converged: YES YES NO YES
title: Mulliken charges:
elementType: N N N C H H H C C H H C H H C H H H C H H C H H C H H H Na H H H C H H H C C C C C C C C H H H H H S N N N C H H H C C H H C H H C H H H C H H C H H C H H H Na H H H C H H H C C C C C C C C H H H H H S
charge: -0.600281 -0.596428 -0.609973 -0.193790 0.126675 0.148991 0.169875 -0.052892 -0.067628 0.129046 0.124201 -0.072204 0.132112 0.153200 -0.187429 0.178504 0.128487 0.112862 -0.053954 0.131036 0.111791 -0.188411 0.156389 0.143376 -0.196377 0.126375 0.131156 0.170941 0.387255 0.124672 0.129191 0.127090 -0.197445 0.160977 0.132103 0.129377 -0.238982 0.118201 -0.151069 -0.135087 -0.131787 -0.117504 -0.373589 -0.182082 0.108020 0.109989 0.111343 0.129971 0.067234 0.099549 -0.630578 -0.605214 -0.589584 -0.192228 0.126072 0.165410 0.154709 -0.063799 -0.064134 0.132491 0.119855 -0.080035 0.130864 0.136604 -0.182548 0.152490 0.132128 0.121370 -0.047279 0.126873 0.110282 -0.210692 0.140286 0.173894 -0.192126 0.130226 0.129891 0.173585 0.442067 0.126030 0.165188 0.130091 -0.192744 0.129292 0.131518 0.164808 -0.221243 0.109357 -0.158286 -0.133844 -0.132617 -0.116818 -0.371021 -0.217949 0.113396 0.110708 0.111298 0.130531 0.102090 0.116262
chargesum: -0.00000
title: Mulliken charges with hydrogens summed into heavy atoms:
elementType: N N N C C C C C C C C Na C C C C C C C C C S N N N C C C C C C C C Na C C C C C C C C C S
charge: -0.600281 -0.596428 -0.609973 0.251750 0.200970 0.185619 0.213109 0.232423 0.188874 0.238444 0.232096 0.387255 0.225013 -0.238982 0.118201 -0.043049 -0.025099 -0.020444 0.012467 -0.373589 -0.114849 0.099549 -0.630578 -0.605214 -0.589584 0.253962 0.227419 0.188212 0.187432 0.223439 0.189876 0.233579 0.241575 0.442067 0.232875 -0.221243 0.109357 -0.044891 -0.023136 -0.021319 0.013713 -0.371021 -0.115859 0.116262
polarizability: 5.57393072e+02 3.12175896e+01 3.94820215e+02 -2.02505002e+01 -7.85616565e+00 4.46105197e+02
1716.lowfreq: -2.7985 -0.0005 -0.0004 0.0007 1.6706 4.7254 9.6057 17.6140 21.0896
redmass: 5.6323 4.8123 5.2242 5.0975 4.4259 4.4634 5.0982 3.9029 4.1528 5.1245 4.6862 3.7771 3.9043 3.2858 4.0567 3.5011 3.3274 3.3593 4.5492 4.6583 4.7721 3.0796 3.6437 4.0320 4.6774 2.9869 2.7235 3.1955 2.6429 3.7977 5.4869 9.4672 9.1517 5.4702 3.6971 4.7329 2.8813 4.0109 3.6066 3.4259 1.6513 1.4153 1.2762 1.2113 2.4569 1.1567 1.7234 2.0347 1.5444 1.3394 1.2149 1.3265 2.0696 1.9106 2.2457 2.0585 6.0547 5.8375 2.6630 2.3974 2.1576 2.6875 2.2316 1.8236 2.0084 1.9951 1.9735 3.1070 3.0384 1.9703 1.9764 1.9500 2.0845 2.1545 2.1560 2.1187 7.7577 7.7833 5.9984 6.0558 8.7556 8.6623 2.4970 2.5264 3.5559 3.8051 2.8973 2.9502 8.5259 8.2813 6.7017 6.6490 2.5703 2.1348 1.3975 1.7730 8.4935 8.3647 2.3123 2.3140 2.5731 2.5782 2.9811 3.0397 1.3882 1.2270 1.4412 1.5205 4.0676 4.8742 1.9455 1.9205 1.3652 1.3639 2.2545 2.2218 2.1694 2.2023 1.2683 1.2699 2.1544 2.1500 2.1978 2.2008 1.9420 1.9272 1.9880 1.9206 1.8421 1.8450 1.4880 1.5129 1.4747 1.9235 2.7857 4.3951 1.9252 1.8898 1.8010 1.7326 1.2905 1.3072 1.3187 1.3407 1.3838 1.4570 1.4681 1.3766 1.8302 1.7594 1.1910 1.1847 1.4320 1.4758 1.6819 1.6793 1.2395 1.8621 1.8143 1.2746 2.4585 2.4579 2.9016 2.7961 2.2827 2.2241 1.8638 1.8884 1.9220 1.7820 2.2715 2.0848 1.5834 1.5388 1.3657 1.4604 1.6295 1.5962 1.4991 1.4430 6.2780 6.3898 1.4255 1.4256 1.3519 1.3561 1.4912 1.4838 1.4191 1.3559 3.0728 1.9783 1.4063 1.1793 1.2455 1.1977 1.1775 1.1691 1.1123 1.1151 1.1625 1.1505 1.0667 1.0563 1.0748 1.1052 1.0580 1.0816 1.0925 1.0856 1.0824 1.1500 2.0137 1.5261 1.5076 1.0988 1.0751 1.0970 1.0649 1.0799 1.0806 1.0796 1.0826 1.0751 1.0704 1.0697 1.0636 1.4773 1.2529 1.1450 1.3851 2.8701 1.0824 1.0742 6.1386 6.1510 6.2115 6.1954 1.0717 1.0717 1.0714 1.0711 1.0701 1.0571 1.0593 1.0565 1.0633 1.0613 1.0625 1.0589 1.0602 1.0580 1.0616 1.0616 1.0695 1.0738 1.0875 1.0878 1.0879 1.0823 1.0884 1.0778 1.0805 1.0790 1.0779 1.0779 1.0828 1.0820 1.0871 1.0772 1.0772 1.0769 1.0886 1.0878 1.0868 1.1010 1.1033 1.1003 1.1026 1.0958 1.1013 1.0936 1.1041 1.0998 1.1031 1.1017 1.0871 1.0867 1.0875 1.0877 1.0940 1.0937 1.0983 1.0983
irintensity: 0.3305 0.0668 0.0400 0.1393 0.4655 1.0546 0.2253 0.9336 0.1743 0.8246 1.5762 0.2640 0.4013 0.9032 0.3071 0.2055 0.8528 1.1012 1.2290 1.2517 2.1439 0.8172 0.3511 0.0715 4.2383 1.6935 1.3592 3.0134 0.8796 7.5269 4.3709 16.5996 15.6140 7.7439 13.8160 2.3604 17.5873 6.9138 14.1732 2.1893 1.8536 0.9130 1.4493 0.3565 2.2751 0.9521 10.0202 27.5103 6.8264 1.4484 0.5079 1.5147 2.2213 1.2069 1.3704 0.7741 0.1530 0.1258 4.7444 5.2089 4.3808 6.1370 1.0015 0.1804 9.9108 8.9588 5.6580 0.0154 0.3662 4.0001 0.9702 6.7106 1.8674 0.0858 1.2482 2.6005 1.0385 1.2936 2.9989 33.2058 1.7056 2.4710 8.6744 4.5645 6.6072 9.5038 4.6711 4.8968 1.6818 0.2284 2.3399 2.8271 14.6466 19.9965 18.6115 18.7904 62.5945 10.6980 8.0937 9.2712 3.6778 34.7741 64.2665 4.7678 24.3853 24.8973 3.5024 11.3409 3.0800 5.4358 8.1594 8.8614 3.0194 3.4837 11.4871 35.8247 6.9473 9.8433 0.0846 0.0210 17.2628 18.0984 7.4481 6.7419 17.1075 6.0351 10.3793 12.2463 11.7735 7.2590 11.6437 13.3070 2.4849 30.7165 3.3266 14.1468 23.2424 26.0611 6.5213 5.0381 1.4328 1.6841 1.9021 3.1391 2.2005 4.3249 3.7392 4.4578 40.1080 29.7642 3.6453 2.1852 20.3509 21.8931 21.4120 35.5876 2.1631 16.4115 8.5261 2.2796 10.0489 6.6127 2.5656 4.5713 0.1405 0.1330 2.1870 5.2157 5.4611 1.9681 0.9285 6.2905 3.1470 6.6113 9.9031 4.5651 22.6377 27.6257 24.5364 18.5451 6.7445 8.3958 11.4463 14.1133 0.1120 49.2857 9.3372 6.0168 3.2150 2.1724 16.2880 10.3825 3.8950 0.3732 1.9744 0.9486 1.1915 2.6748 3.1722 1.7141 1.7080 5.4476 16.5137 2.5834 11.8561 9.8977 3.9407 6.1966 0.0510 11.7653 5.4058 4.7067 14.7696 28.6378 32.6766 5.4110 20.6698 10.5926 27.1213 2.3826 16.0385 2.2690 2.9721 14.6472 19.1111 7.1383 16.1747 16.5923 6.7632 35.4166 14.8816 3.2898 16.1932 11.1156 0.1685 2.5851 2.5137 1.7924 26.7635 31.0980 2.0187 30.5245 22.3819 40.6986 43.2081 20.0314 34.3633 22.2868 64.4123 96.8710 91.0128 199.4086 199.7677 193.2580 226.9036 166.2517 11.5132 11.0632 7.3053 22.5323 8.1638 39.6505 20.2233 5.1061 35.0486 22.5027 20.1861 5.0417 21.6945 9.7304 13.5387 16.6395 38.4801 28.9353 47.3303 25.0614 11.0506 2.1025 7.5908 30.8570 13.1962 14.7651 9.3807 4.2391 7.9514 8.2612 8.6845 8.4509 1.0078 1.4649 28.1089 29.7753 75.5492 7.1885
temp: 298.150 k
press: 1.00000 atm
elementType: 7 7 7 6 1 1 1 6 6 1 1 6 1 1 6 1 1 1 6 1 1 6 1 1 6 1 1 1 11 1 1 1 6 1 1 1 6 6 6 6 6 6 6 6 1 1 1 1 1 16 7 7 7 6 1 1 1 6 6 1 1 6 1 1 6 1 1 1 6 1 1 6 1 1 6 1 1 1 11 1 1 1 6 1 1 1 6 6 6 6 6 6 6 6 1 1 1 1 1 16
symmnumber: 1
zpe: 2288478.6 jmol-1
zpe.correction: 0.871635 hartree
zpe.thermalcorrener: 0.922401 hartree
zpe.thermalcorrenthalpy: 0.923345 hartree
zpe.thermalcorrgfe: 0.784179 hartree
zpe.sumelectzpe: -2777.502768 hartree
zpe.sumelectthermal: -2777.452003 hartree
zpe.sumelectthermalent: -2777.451059 hartree
zpe.sumelectthermalfe: -2777.590225 hartree
dipole: -0.4212 -0.1773 1.6018
dipole: 1.6657
quadrupole: -299.3465 -254.8116 -273.2243
quadrupole: -11.6509 -6.9326 -1.8430
quadrupole: -23.5524 20.9825 2.5699 -11.6509 -6.9326 -1.8430
hfenergy: -2778.3744036 hartree
pointgroup: C01 [X(C34H56N6Na2S2)]
dipole: -0.1800193 -0.0366104 0.6290721 debye
polarizability: 558.5060462|29.7241028|393.9590549|-19.3419067|-4.4341171|445.8533834 unknown
InChI: InChI=1/2C9H23N3.2C8H5S.2Na/c2*1-10(2)6-8-12(5)9-7-11(3)4;2*1-2-4-8-7(3-1)5-6-9-8;;/h2*6-9H2,1-5H3;2*1-5H;;/rC34H56N6Na2S2/c1-35-19-21-36(2,3)41(37(4,5)22-20-35)33(27-29-15-11-13-17-31(29)43-33)42(34(41)28-30-16-12-14-18-32(30)44-34)38(6,7)23-25-40(42,10)26-24-39(42,8)9/h11-18,27-28H,19-26H2,1-10H3
charge 0 multiplicity 1
100 atoms
N  -0.26370132 3.15434813 2.2051875
N  0.15637713 3.15612359 -1.82499976
N  -2.26602775 3.3662729 -0.00322525
C  -3.52331588 2.65794156 0.21961941
H  -4.39479914 3.33511883 0.16234216
H  -3.51989365 2.17833431 1.20090161
H  -3.64040316 1.86575334 -0.52147617
C  -1.53644457 3.85597304 2.332015
C  -2.06673647 4.40166886 1.00788108
H  -3.00828397 4.94450146 1.20977591
H  -1.36735444 5.14816671 0.62453034
C  -2.19840873 3.8927683 -1.36529819
H  -2.8479226 4.77961487 -1.49118015
H  -2.59676634 3.12175914 -2.03168622
C  0.83275722 4.04031113 1.83490244
H  1.74958644 3.45368914 1.73023238
H  0.99979354 4.83627852 2.58374434
H  0.63083463 4.51180207 0.87093821
C  -0.78621092 4.27184423 -1.81285149
H  -0.86009887 4.74111331 -2.81262944
H  -0.38082477 5.04258821 -1.14851555
C  -0.11250555 2.24732819 -2.93511027
H  -1.108768 1.81015275 -2.84599644
H  0.60998993 1.42881272 -2.91459858
C  1.53308755 3.63427159 -1.90121351
H  1.75335833 4.28360062 -1.04955761
H  1.72757421 4.20080326 -2.82991018
H  2.21849458 2.78467426 -1.85693032
Na -0.34440152 1.67327773 0.18166114
H  -1.46283406 4.69706568 3.04858238
H  -2.26147556 3.14996392 2.75105025
H  -0.03430625 2.75826174 -3.91241468
C  0.06290643 2.44474724 3.43320897
H  0.99521036 1.89313354 3.29129721
H  0.18466256 3.12734394 4.29409262
H  -0.72921776 1.72819606 3.66930598
C  -4.17018549 -0.87134985 -1.23141135
C  -3.94413984 -1.05461839 0.14829092
C  -5.00693951 -1.49415292 0.95461927
C  -6.24611082 -1.73957783 0.38621953
C  -6.45341653 -1.55299253 -0.98966037
C  -5.41979813 -1.1183344 -1.8062026
C  -1.73542442 -0.32259715 -0.49776453
C  -2.57783717 -0.73531665 0.50553492
H  -4.85247385 -1.63706437 2.02139904
H  -7.06813284 -2.07934686 1.00922424
H  -7.43128964 -1.75010636 -1.41821446
H  -5.57870244 -0.97336146 -2.87076089
H  -2.24451644 -0.81749408 1.53987942
S  -2.68395706 -0.32144394 -1.98251368
N  0.27990151 -2.35301495 2.60290059
N  -0.27714252 -3.58208652 -1.10108784
N  2.24853277 -3.35195166 0.46008322
C  3.55143819 -2.71417261 0.29534871
H  4.38183214 -3.43503478 0.40458928
H  3.68002672 -1.9194222 1.0333829
H  3.61680532 -2.24409512 -0.68796516
C  1.64044627 -2.842061 2.826838
C  2.09753516 -3.88705393 1.81344318
H  3.04931216 -4.32116774 2.16851232
H  1.38103949 -4.71239573 1.79448228
C  2.03312912 -4.37299122 -0.56150816
H  2.58661549 -5.30336006 -0.33532504
H  2.44880145 -3.9964217 -1.50085049
C  -0.73796478 -3.3572521 2.87327157
H  -1.72535166 -2.9363134 2.66428719
H  -0.71694017 -3.70863722 3.92119734
H  -0.61105431 -4.22212843 2.21749051
C  0.56108197 -4.72546461 -0.76289051
H  0.49939436 -5.51327233 -1.53888558
H  0.1578637 -5.1685723 0.15479501
C  0.03660868 -3.03991499 -2.4187332
H  1.05320611 -2.63438934 -2.4348798
H  -0.65322299 -2.22247862 -2.63986184
C  -1.69021877 -3.93321383 -1.01116493
H  -1.92459322 -4.25579685 0.00775731
H  -1.96480197 -4.74568213 -1.70795398
H  -2.30264359 -3.05759788 -1.23365895
Na 0.34904573 -1.58870145 0.27831619
H  1.74144294 -3.26822908 3.8434445
H  2.30882923 -1.97607556 2.77415093
H  -0.04780952 -3.8009265 -3.2159291
C  0.05165012 -1.15242136 3.3971092
H  -0.9687286 -0.79248894 3.23637995
H  0.18738084 -1.33049639 4.47932875
H  0.73896827 -0.37260435 3.06170905
C  4.37461712 0.85485292 0.09073816
C  3.61784386 0.51242507 -1.04900362
C  4.26820892 0.41232945 -2.28970292
C  5.63191231 0.64634671 -2.37207201
C  6.37046714 0.98429031 -1.22783092
C  5.74861222 1.09126237 0.00836236
C  1.85386949 0.47536722 0.60062335
C  2.2242722 0.31083388 -0.71352317
H  3.69861707 0.15337713 -3.17924883
H  6.13601767 0.56931061 -3.33082483
H  7.43791997 1.16471305 -1.3103201
H  6.32029438 1.35445026 0.89352566
H  1.4986524 0.04427884 -1.48517152
S  3.30960623 0.90179002 1.48517843
