program: Gaussian 09
title: 000070158
version: EM64L-G09RevD.01
frameworkgroup: C1[X(C12H14N2)]
method: RPBEPBE
basis: SDD
operation: Freq
keyword: #p
keyword: freq=noraman
keyword: PBEPBE/SDD
title: #p freq=noraman PBEPBE/SDD
converged: NO YES NO NO
title: Mulliken charges:
elementType: N N C C C C C C C C C C C C H H H H H H H H H H H H H H
charge: -0.064396 -0.064462 -0.411977 -0.411680 -0.092904 -0.093029 -0.093301 -0.093457 -0.161124 -0.161167 -0.160956 -0.160974 -0.113759 -0.113753 0.292937 0.293093 0.292939 0.293130 0.294006 0.294015 0.293945 0.293952 0.303883 0.303897 0.303872 0.303887 0.316701 0.316680
chargesum: 2.00000
title: Mulliken charges with hydrogens summed into heavy atoms:
elementType: N N C C C C C C C C C C C C
charge: -0.064396 -0.064462 0.174054 0.174389 0.201102 0.200986 0.200644 0.200494 0.142759 0.142730 0.142916 0.142913 0.202942 0.202927
polarizability: 1.85751544e+02 1.24788467e-04 1.33583932e+02 1.66139429e+01 -7.53961820e-04 6.19960330e+01
1716.lowfreq: -9.6735 -0.0008 -0.0007 0.0001 9.3679 23.3963 26.5249 41.1819 62.7478
frequency: 26.5188 41.1815 62.7477 70.4785 119.7162 228.0621 277.3501 349.9867 393.3950 393.8411 395.7882 446.1638 489.9206 529.6353 615.5387 638.6721 640.1984 686.1272 686.2241 771.4373 779.8326 786.5725 813.5294 843.7441 853.9905 854.6040 950.9483 952.9905 989.0665 989.1416 1011.9141 1012.2766 1027.7694 1030.0679 1030.1157 1035.4607 1045.7949 1046.3331 1078.6259 1131.3935 1165.1576 1174.1535 1186.8784 1192.7401 1212.8470 1219.3573 1221.2697 1281.8315 1348.7827 1355.0314 1355.2391 1382.8451 1385.6187 1396.0053 1460.8489 1467.2643 1477.6387 1478.6539 1497.3379 1505.0443 1565.1437 1565.9342 1616.0228 1617.1469 3041.4108 3048.8819 3101.3420 3119.8261 3179.2279 3179.2796 3181.7142 3181.9444 3187.8597 3188.0873 3198.4548 3198.5723 3205.2939 3205.4099
redmass: 3.7701 3.8741 4.4066 2.9198 5.0428 4.9156 3.5879 2.1154 2.6963 2.6662 2.8153 3.7884 3.6138 6.1025 5.3044 6.3301 6.4006 2.0531 1.9845 1.5850 2.0999 2.7894 1.1531 4.0098 1.2782 1.2783 1.3491 1.3243 1.3814 1.3821 5.2386 5.2599 4.2743 1.3821 1.3971 1.8677 2.4472 2.4580 1.7427 1.5300 4.4783 4.5368 1.1171 1.0672 1.1540 1.1672 1.1665 1.3451 1.2156 1.4408 1.4576 2.7401 2.3260 1.2355 1.4898 1.7256 2.2771 2.2717 1.2855 1.1519 5.6995 5.6651 4.9782 4.9428 1.0620 1.0594 1.1077 1.1083 1.0917 1.0917 1.0914 1.0914 1.0964 1.0963 1.0990 1.0990 1.1038 1.1037
irintensity: 0.0026 0.2389 0.2372 0.0002 0.0000 0.0000 3.4823 0.0000 0.0675 0.0000 0.0060 0.0001 23.4887 3.7731 0.0000 0.0001 0.9720 7.8919 106.7590 0.0013 88.1662 44.9411 1.3541 0.0003 0.0576 0.0002 0.0007 2.4523 0.0022 0.0003 0.1174 22.7158 0.0000 0.5509 0.0013 0.0002 5.5814 0.0119 7.6029 0.0004 0.4145 121.6337 6.0900 0.0002 2.7962 6.2495 0.0005 0.0007 2.5982 0.2751 3.8132 2.0347 0.0011 0.0003 0.0016 32.2912 0.2581 113.3754 0.0036 24.3081 0.0097 0.5348 100.1361 0.0724 0.0064 5.3921 0.0001 0.1277 0.0160 0.0069 0.0108 0.1985 5.7667 1.0447 4.9316 19.1308 14.9192 0.8571
temp: 298.150 k
press: 1.00000 atm
elementType: 7 7 6 6 6 6 6 6 6 6 6 6 6 6 1 1 1 1 1 1 1 1 1 1 1 1 1 1
symmnumber: 1
zpe: 624888.8 jmol-1
zpe.correction: 0.238008 hartree
zpe.thermalcorrener: 0.249748 hartree
zpe.thermalcorrenthalpy: 0.250692 hartree
zpe.thermalcorrgfe: 0.197941 hartree
zpe.sumelectzpe: -573.587540 hartree
zpe.sumelectthermal: -573.575799 hartree
zpe.sumelectthermalent: -573.574855 hartree
zpe.sumelectthermalfe: -573.627606 hartree
dipole: 0.0016 -0.0017 0.0008
dipole: 0.0024
quadrupole: 40.2528 -50.3207 -79.4811
quadrupole: -0.0001 3.9268 -0.0003
quadrupole: 70.1025 -20.4711 -49.6314 -0.0001 3.9268 -0.0003
hfenergy: -573.8255475 hartree
pointgroup: C01 [X(C12H14N2)]
dipole: -0.0006095 -0.0006668 -0.0003029 debye
polarizability: 185.5713931|0.0021457|133.5839315|17.2709377|-0.0047523|62.176184 unknown
InChI: InChI=1S/C12H14N2/c1-3-7-13(8-4-1)11-12-14-9-5-2-6-10-14/h1-10H,11-12H2
charge 2 multiplicity 1
28 atoms
N  -1.89449 -0.003457 0.336828
N  1.893429 -0.003321 -0.33734
C  -0.426604 -0.007011 0.651608
C  0.42516 -0.006852 -0.653652
C  -2.565904 -1.202346 0.190177
C  2.564561 -1.202105 -0.190243
C  -2.561853 1.198672 0.198558
C  2.560642 1.19867 -0.198901
C  -3.934757 -1.220063 -0.108001
C  3.933387 -1.220026 0.108264
C  -3.930604 1.223154 -0.099505
C  3.929366 1.22327 0.09948
C  -4.633309 0.003254 -0.256976
C  4.631917 0.003312 0.257129
H  -0.203251 0.882654 1.264067
H  -0.20729 -0.899277 1.26174
H  0.202787 0.883121 -1.265914
H  0.20686 -0.899148 -1.264006
H  -1.987671 -2.11833 0.33506
H  1.986519 -2.118247 -0.335021
H  -1.980546 2.111642 0.349985
H  1.979617 2.111824 -0.350427
H  -4.443758 -2.181639 -0.211218
H  4.442254 -2.181618 0.21177
H  -4.436389 2.187122 -0.195995
H  4.43513 2.187219 0.196041
H  -5.703791 0.005849 -0.482838
H  5.702387 0.005879 0.48313
