program: Gaussian 09
title: 000004755
version: EM64L-G09RevD.01
frameworkgroup: C1[X(C12H12ClN7O)]
method: RPBEPBE
basis: SDD
operation: Freq
keyword: #p
keyword: freq=noraman
keyword: PBEPBE/SDD
title: #p freq=noraman PBEPBE/SDD
converged: YES YES NO NO
title: Mulliken charges:
elementType: Cl O N N N N N N N C C C C C C C C C C C C H H H H H H H H H H H H
charge: -0.083811 -0.421407 -0.446927 0.168012 -0.154919 -0.072775 -0.626969 -0.676264 -0.612185 0.435588 -0.105725 -0.447032 -0.320693 0.128047 0.271253 0.146585 -0.204975 -0.231029 -0.255541 0.282717 -0.403289 0.292215 0.210128 0.367520 0.223551 0.233531 0.226550 0.388930 0.315129 0.410853 0.299406 0.332714 0.330815
chargesum: 0.00000
title: Mulliken charges with hydrogens summed into heavy atoms:
elementType: Cl O N N N N N N N C C C C C C C C C C C C
charge: -0.083811 -0.421407 -0.154713 0.168012 -0.154919 -0.072775 0.077089 0.033995 0.051345 0.435588 -0.105725 -0.236904 0.046827 0.128047 0.271253 0.146585 0.018576 0.002502 -0.028991 0.282717 -0.403289
polarizability: 3.27242488e+02 -4.54030937e+00 2.82137598e+02 -1.30892458e-01 4.06856573e-02 7.37044209e+01
1716.lowfreq: -3.4538 -0.0029 -0.0022 -0.0013 3.0728 5.0094 25.8799 37.6608 42.1811
frequency: 25.8514 37.6604 42.1804 57.9436 72.1729 97.8610 126.2546 133.4150 180.3115 223.6897 229.5681 241.4319 250.5617 275.3928 321.2545 342.6175 347.4007 355.4448 386.7337 388.9152 410.2689 431.7541 471.8872 511.4554 512.6893 526.5458 530.3160 562.7292 565.1365 591.0859 607.2310 615.2571 637.1382 663.7287 688.9938 690.6737 698.4063 710.4082 722.2876 765.6228 778.1874 806.4291 816.6264 845.1244 853.9189 856.9281 926.0228 928.2932 974.3572 977.7787 983.4144 1022.8683 1030.6102 1032.7489 1070.1539 1093.7528 1151.8665 1162.1884 1170.6616 1187.1398 1249.7220 1256.2981 1296.7198 1317.3461 1358.1515 1375.5049 1395.4822 1420.8141 1443.0655 1453.0892 1460.2644 1482.3804 1505.1788 1521.1632 1547.4559 1560.1426 1576.1651 1606.0169 1609.7889 1617.7723 1637.8547 3097.6333 3129.9811 3142.4169 3161.4207 3168.6621 3232.0275 3312.8144 3527.7408 3535.2340 3603.6487 3629.4556 3690.2028
redmass: 7.7606 7.6291 4.6156 4.3261 4.4093 6.7068 8.2639 8.7939 7.2924 6.6805 5.2440 4.8584 4.8662 4.8919 5.9739 7.5412 4.1095 3.9252 1.5240 5.0104 2.9525 7.5889 2.9607 1.4358 2.2404 5.2976 1.1013 1.4547 3.6471 9.4677 1.2524 6.4232 6.8559 9.5350 8.4921 7.8085 2.1097 8.1775 7.5685 1.6748 3.8637 5.4474 1.2434 1.2886 8.2335 1.1732 1.3834 5.2797 1.3312 2.5172 5.8517 2.3494 2.8638 1.2776 1.7883 1.5587 2.9668 2.2599 1.0539 1.1159 2.9041 4.6055 2.4826 2.9455 2.2492 3.7550 6.0491 6.8118 2.7899 4.5391 4.6681 2.3702 1.7647 2.6140 2.5332 3.0621 2.7051 3.2524 3.5462 2.1177 2.1484 1.0889 1.0864 1.0927 1.0970 1.0998 1.0639 1.0598 1.0755 1.0445 1.0892 1.0919 1.1054
irintensity: 0.2629 0.3020 7.3297 4.6739 6.7866 0.8066 2.0394 2.3500 0.9535 5.0843 2.7502 1.6976 3.3272 4.0898 3.1579 6.9159 14.1417 21.8233 25.0509 5.3848 0.1523 4.3741 84.1536 50.4302 126.6998 24.8441 8.1544 257.4454 14.3153 7.8289 113.1442 4.8620 20.0918 11.7947 33.2280 4.6381 58.4989 11.3342 1.2218 86.9174 2.1713 1.3194 42.5582 0.8544 48.9587 229.8389 13.5104 46.5766 0.3227 12.2708 3.2366 6.6192 94.6895 6.1602 6.4039 9.5611 2.1052 6.4272 0.3178 2.3748 23.7878 62.2641 27.0868 297.4846 129.7012 211.2226 28.9630 856.4499 66.7580 295.6797 350.9345 26.0487 60.8886 733.0232 99.0346 367.3138 391.1526 99.7903 197.6027 677.1567 263.1131 18.1467 1.8584 38.2704 3.4347 71.2881 253.3721 142.4434 31.8181 152.7371 44.9704 98.1825 50.2248
temp: 298.150 k
press: 1.00000 atm
elementType: 17 8 7 7 7 7 7 7 7 6 6 6 6 6 6 6 6 6 6 6 6 1 1 1 1 1 1 1 1 1 1 1 1
symmnumber: 1
zpe: 637854.6 jmol-1
zpe.correction: 0.242946 hartree
zpe.thermalcorrener: 0.261704 hartree
zpe.thermalcorrenthalpy: 0.262648 hartree
zpe.thermalcorrgfe: 0.194667 hartree
zpe.sumelectzpe: -1381.580738 hartree
zpe.sumelectthermal: -1381.561981 hartree
zpe.sumelectthermalent: -1381.561036 hartree
zpe.sumelectthermalfe: -1381.629018 hartree
dipole: -0.3174 2.6496 -0.0095
dipole: 2.6686
quadrupole: -86.0220 -107.9836 -135.7376
quadrupole: -17.8053 -0.1066 0.1042
quadrupole: 23.8924 1.9308 -25.8232 -17.8053 -0.1066 0.1042
hfenergy: -1381.8236845 hartree
pointgroup: C01 [X(C12H12Cl1N7O1)]
dipole: -0.0347554 -1.0492739 -0.0107431 debye
polarizability: 326.0100762|8.4133215|283.2074704|-5.4304581|2.9121813|73.8669603 unknown
InChI: InChI=1S/C12H12ClN7O/c13-8-10(15)19-9(14)7(18-8)11(21)20-12(16)17-6-4-2-1-3-5-6/h1-5,17H,14-16H2
charge 0 multiplicity 1
33 atoms
Cl 1.786776 3.45055 -0.104863
O  1.200206 -2.916394 -0.170804
N  -2.8116 -1.5912 -0.067421
N  1.45411 0.725871 -0.131405
N  -0.484524 -1.222738 -0.113997
N  4.201162 0.133519 -0.186611
N  3.736667 -2.159516 -0.205585
N  -1.37227 -3.453801 -0.13633
N  4.700592 2.428607 -0.170006
C  -3.28332 -0.241646 -0.033172
C  1.844145 -0.588858 -0.153805
C  -4.695508 -0.074641 0.00634
C  -2.436365 0.899102 -0.035996
C  3.268676 -0.878147 -0.182309
C  -1.515851 -2.081999 -0.106675
C  0.820778 -1.654839 -0.147105
C  -5.259743 1.21622 0.043384
C  -3.021107 2.183864 0.001135
C  -4.423818 2.357298 0.04115
C  3.770655 1.422032 -0.164621
C  2.351146 1.680247 -0.136501
H  -3.554588 -2.293654 -0.059266
H  -5.353159 -0.955177 0.008222
H  -1.352918 0.759762 -0.066374
H  -6.349274 1.328457 0.07374
H  -2.360335 3.058097 -0.00121
H  -4.859692 3.361713 0.070139
H  3.023093 -2.907055 -0.201534
H  4.742715 -2.314525 -0.224493
H  -0.381735 -3.765908 -0.159155
H  -2.156843 -4.103429 -0.136123
H  4.401093 3.401311 -0.152147
H  5.687836 2.181979 -0.189602
