program: Gaussian 09
title: 000070163
version: EM64L-G09RevD.01
frameworkgroup: C1[X(C12H10O3)]
method: RPBEPBE
basis: SDD
operation: Freq
keyword: #pfreq=noraman
keyword: PBEPBE/SDD
title: #p freq=noraman PBEPBE/SDD
converged: NO YES NO NO
title: Mulliken charges:
elementType: O O O C C C C C C C C C C C C H H H H H H H H H H
charge: -0.408793 -0.274299 -0.326017 0.415089 0.432914 -0.540998 0.100501 -0.568196 0.144102 -0.418244 -0.410612 -0.246791 -0.232534 0.225159 -0.496240 0.275204 0.263653 0.244291 0.244797 0.230835 0.229695 0.385849 0.247048 0.236550 0.247035
chargesum: 0.00000
title: Mulliken charges with hydrogens summed into heavy atoms:
elementType: O O O C C C C C C C C C C C C
charge: -0.022943 -0.274299 -0.326017 0.415089 0.432914 -0.265794 0.100501 -0.304544 0.144102 -0.173953 -0.165814 -0.015956 -0.002839 0.225159 0.234394
polarizability: 2.47368338e+02 -1.12645860e+01 1.53499904e+02 8.23313515e-03 -1.53665082e-02 5.90436391e+01
1716.lowfreq: -12.4566 -0.0008 -0.0006 -0.0005 3.1965 6.7431 64.1883 77.6569 99.1367
frequency: 64.1817 77.6351 99.1335 128.4899 131.3035 155.2695 250.2432 272.0041 304.9550 305.6501 349.7747 393.1055 423.3205 436.3317 476.7897 538.8334 552.8195 587.2561 621.1158 645.7894 714.1615 745.8439 747.8639 759.4715 779.4310 814.1177 815.1828 857.0081 896.1111 900.0948 911.3107 931.5371 970.2849 992.3878 1018.7854 1047.9246 1114.2608 1129.2670 1150.8505 1172.5493 1178.3635 1218.1573 1225.9704 1273.7655 1289.9731 1322.2328 1379.4478 1416.1784 1422.1504 1429.1655 1443.0444 1451.5761 1459.8550 1463.3401 1513.4896 1551.7063 1572.2279 1623.0740 1658.7257 3009.4378 3086.6819 3113.6825 3122.7044 3128.7962 3145.6439 3154.9434 3155.2242 3159.8700 3164.1913
redmass: 3.3978 1.4958 2.6228 4.1849 5.9248 4.3952 4.4955 4.3813 5.3864 5.9518 5.6428 8.7613 3.5987 8.8767 2.5455 3.7539 4.6947 7.0540 6.8246 5.2982 6.6741 5.8759 4.7788 1.2868 2.4430 1.1437 4.3215 1.3441 6.0512 1.6023 6.5012 1.6290 1.4219 1.3454 2.3188 5.1116 1.2583 1.7596 1.5032 1.1362 1.4529 2.0932 1.6474 1.9725 2.8722 2.2308 2.5505 3.3835 1.6983 3.1250 2.3796 1.0496 2.1268 1.2372 3.5717 5.0691 6.6323 5.4907 5.7688 1.0293 1.0680 1.1049 1.0861 1.0886 1.0953 1.1019 1.0952 1.0924 1.1001
irintensity: 0.8843 0.7914 0.0679 1.4309 0.7562 2.9291 3.0003 3.4154 2.3854 0.5051 32.9423 7.8880 0.1267 2.6564 25.1487 0.0544 1.5640 5.9956 4.5864 0.9330 12.1879 3.7543 0.6053 35.8330 7.5085 187.1432 9.1682 0.4226 15.7797 33.8066 4.6682 6.3788 12.3150 0.1031 3.3533 103.8567 0.0429 35.2537 73.1826 6.5014 32.8164 320.6080 62.6200 11.3566 167.6142 132.5644 110.5620 10.3595 105.5444 38.7765 4.4067 15.0487 84.1212 2.8032 124.9786 36.7143 26.3569 6.8324 296.5716 42.2318 370.9829 22.6702 2.9881 0.5088 27.1522 13.9253 0.3027 5.9547 33.1032
temp: 298.150 k
press: 1.00000 atm
elementType: 8 8 8 6 6 6 6 6 6 6 6 6 6 6 6 1 1 1 1 1 1 1 1 1 1
symmnumber: 1
zpe: 498938.9 jmol-1
zpe.correction: 0.190036 hartree
zpe.thermalcorrener: 0.202545 hartree
zpe.thermalcorrenthalpy: 0.203490 hartree
zpe.thermalcorrgfe: 0.150943 hartree
zpe.sumelectzpe: -687.915331 hartree
zpe.sumelectthermal: -687.902821 hartree
zpe.sumelectthermalent: -687.901877 hartree
zpe.sumelectthermalfe: -687.954424 hartree
dipole: 0.0024 -3.3463 0.0061
dipole: 3.3463
quadrupole: -68.2615 -84.4928 -90.5849
quadrupole: 9.8053 -0.0126 -0.0051
quadrupole: 12.8516 -3.3798 -9.4718 9.8053 -0.0126 -0.0051
hfenergy: -688.1053665 hartree
pointgroup: C01 [X(C12H10O3)]
dipole: 0.0375346 1.3159874 0.0075501 debye
dipolederiv: -1.0643185 -0.5021212 -0.0159141 -0.5891959 -0.8733695 -0.0151719 -0.0172299 -0.0134913 -0.3964015 -1.0851838 0.3832207 -0.012009 1.0818374 -1.1074628 0.0136228 -0.0071236 0.0010206 -0.28535 -1.1642 -0.2454747 -0.0168259 -0.1285036 -0.8372234 -0.0060544 -0.0158472 -0.0090725 -0.3438313 -0.4704905 0.2266161 -0.0073736 0.0591893 -0.188111 -0.0004537 -0.0086927 0.0024905 0.0174014 0.3824576 0.3434684 0.0084827 0.0825401 0.1628699 0.0024414 0.0069139 0.0072702 0.0529164 0.7013577 -0.1722124 0.0132785 0.3199804 -0.0204678 0.0065153 0.0168911 -0.0022492 -0.1009914 -1.2527523 0.138001 -0.0211062 -0.2150466 -0.1891047 -0.0052569 -0.0237869 0.0010941 -0.0445996 -0.5345716 -0.5116966 -0.0099345 -0.0659574 0.0026375 0.0002315 -0.0071757 -0.0082782 -0.2011739 0.9436165 0.7844758 0.022294 0.4144546 0.6379928 0.0126027 0.0208241 0.0199478 0.0778773 0.2395675 -0.1353569 0.006239 0.1808326 0.0915846 0.0047488 0.0083096 -0.0009993 -0.1563666 -0.1968553 -0.2553217 -0.0020779 -0.1568548 0.0400881 -0.0014681 -0.0012061 -0.0029661 -0.1807611 -0.2302061 0.2008292 0.00034 0.1735978 -0.0441522 0.0038645 0.0003071 0.0044848 -0.1802075 0.1241456 -0.0565648 0.00434 -0.1018023 0.1814342 0.0002747 0.003928 0.0009838 -0.1403246 2.2238457 -0.0957641 0.0350238 -0.8592917 1.4534642 -0.0066359 0.0294178 0.0076405 0.2587248 0.751058 -0.267424 0.0068197 -0.2504565 0.3487371 -0.0041514 0.0073141 -0.0048634 0.2764427 0.11127 0.0018727 -0.0006267 0.0440617 -0.0159322 -0.0004121 -0.0002516 -0.0011789 0.1490944 0.0553911 0.0562853 -0.0017119 0.0249261 -0.033542 -0.0009658 -0.0020901 -0.0006691 0.1692918 0.0626042 0.0919003 -0.0010821 0.0111391 -0.0787464 -0.001235 -0.0015758 0.0002959 0.1554888 0.0530289 0.0132272 -0.0018234 0.0926718 -0.0859322 0.0001205 -0.0013097 -0.0014289 0.1579746 -0.0273679 -0.1076728 -0.0041528 -0.1180781 -0.0324131 -0.0033551 -0.0042813 -0.0031866 0.166525 -0.1379693 0.0430776 -0.0050259 0.0422332 0.0853369 0.0003164 -0.0049376 0.0003011 0.1581594 0.5638448 -0.048199 0.003027 -0.047911 0.4756485 0.0004036 0.0027936 0.0004585 0.3637929 -0.05071 0.0598573 -0.0430525 -0.0360999 0.0693572 -0.0871648 -0.0773226 -0.0428355 -0.0512269 0.0581429 -0.0027106 -0.0011519 0.0818878 -0.1105669 0.0003038 -0.0007563 -0.0012418 0.1228567 -0.0557051 0.0576871 0.044024 -0.0401541 0.0678734 0.0868792 0.0768879 0.046473 -0.0453119 unknown
polarizability: 247.8588012|8.6156052|152.9401845|3.4986864|0.8032221|59.1128957 unknown
InChI: InChI=1S/C12H10O3/c1-15-12(14)10-6-8-4-2-3-5-9(8)7-11(10)13/h2-7,13H,1H3
charge 0 multiplicity 1
25 atoms
O  -1.518372 -2.534162 -0.091174
O  -2.879475 1.505492 -0.084301
O  -3.417803 -0.75312 -0.112037
C  1.258561 0.682092 -0.015826
C  1.706403 -0.702273 -0.016798
C  -0.138318 0.948578 -0.038983
C  -1.082998 -0.092871 -0.063479
C  0.743374 -1.752921 -0.041569
C  -0.628603 -1.475425 -0.065481
C  2.233059 1.738086 0.008205
C  3.119085 -0.965505 0.007282
C  3.596593 1.448104 0.030671
C  4.039596 0.082836 0.030313
C  -2.531806 0.1665 -0.087845
C  -4.33495 1.796026 -0.111047
H  -0.496438 1.983101 -0.037628
H  1.061535 -2.799996 -0.043071
H  1.885253 2.778109 0.008219
H  3.463771 -2.00599 0.006844
H  4.335171 2.256408 0.048889
H  5.11381 -0.132705 0.048048
H  -2.463046 -2.158611 -0.108265
H  -4.790055 1.372288 -1.02144
H  -4.397217 2.892784 -0.106547
H  -4.824932 1.363076 0.77662
