program: Gaussian 09
title: 000070154
version: EM64L-G09RevD.01
frameworkgroup: C1[X(C6F5NO2)]
method: RPBEPBE
basis: SDD
operation: Freq
keyword: #pfreq=noraman
keyword: PBEPBE/SDD
title: #p freq=noraman PBEPBE/SDD
converged: NO NO YES YES
title: Mulliken charges:
elementType: F F F F F O O N C C C C C C
charge: -0.107900 -0.107898 -0.133134 -0.133133 -0.120602 -0.157839 -0.157834 0.040757 0.181683 0.151863 0.151851 0.148393 0.148392 0.095399
chargesum: 0.00000
title: Mulliken charges with hydrogens summed into heavy atoms:
polarizability: 1.18257694e+02 4.40951522e-04 1.03540200e+02 -1.79060983e-03 3.08354555e-03 3.17230514e+01
1716.lowfreq: -71.8450 -5.4930 -0.7068 0.0007 0.0010 0.0011 6.7304 72.9419 114.2690
frequency: -71.8447 72.9417 114.2690 151.6752 198.2565 207.2054 258.0718 270.9734 303.2576 310.8714 337.0166 339.9383 358.8299 384.3623 421.5569 474.0258 548.0485 573.0997 639.0786 693.7655 704.0187 724.5558 747.6284 854.3446 942.0666 1052.7713 1077.4155 1169.7693 1226.3192 1344.4068 1357.2954 1366.2623 1458.6951 1462.8838 1598.5219 1603.9822
redmass: 16.1578 17.0909 18.5149 18.5425 14.0667 16.2457 18.6118 18.5553 18.3438 16.4960 16.7312 12.7959 12.6178 15.7426 16.0618 16.5289 17.3290 12.6625 12.1843 13.3331 14.9627 12.1326 12.6864 14.1449 14.2239 13.5331 13.6594 14.7581 12.6691 12.5967 12.1431 14.0617 12.3843 12.5424 12.0352 12.0243
irintensity: 0.0000 0.9022 0.0000 0.2588 6.8402 1.2662 0.7129 0.8111 1.9146 1.6324 0.0009 0.0987 0.0000 0.1894 0.1167 0.0010 0.2129 0.5726 0.0000 3.4946 57.0060 0.8381 0.0133 0.0153 146.9300 92.1571 2.3047 238.9948 82.3189 14.7006 6.7708 21.6625 98.1982 363.9197 1.7181 80.0544
temp: 298.150 k
press: 1.00000 atm
elementType: 9 9 9 9 9 8 8 7 6 6 6 6 6 6
symmnumber: 1
zpe: 151615.8 jmol-1
zpe.correction: 0.057747 hartree
zpe.thermalcorrener: 0.068719 hartree
zpe.thermalcorrenthalpy: 0.069663 hartree
zpe.thermalcorrgfe: 0.020581 hartree
zpe.sumelectzpe: -931.884138 hartree
zpe.sumelectthermal: -931.873166 hartree
zpe.sumelectthermalent: -931.872222 hartree
zpe.sumelectthermalfe: -931.921304 hartree
dipole: -2.5803 0.0000 0.0009
dipole: 2.5803
quadrupole: -92.0564 -85.6747 -71.0382
quadrupole: -0.0001 0.0024 -0.0010
quadrupole: -9.1333 -2.7516 11.8849 -0.0001 0.0024 -0.0010
hfenergy: -931.9418851 hartree
pointgroup: C01[X(C6F5N1O2)]
dipole: 1.0151801 0.0000047 -0.0003573 debye
dipolederiv: -0.2303941 0.2295141 -0.0000081 0.1952732 -0.7306545 0.0000107 0.0000199 0.0000034 -0.067946 -0.2304102 -0.2295164 -0.000051 -0.1952802 -0.7306187 -0.0000697 -0.0000147 -0.0000688 -0.0679455 -0.3875637 0.3447766 0.0000067 0.4057789 -0.7052801 -0.0000145 0.0000079 0.0000193 -0.077376 -0.3875916 -0.3447893 -0.0000129 -0.4057931 -0.7052537 -0.0000262 -0.000006 -0.0000523 -0.0773758 -1.0423981 0.000014 -0.0000536 0.0000155 -0.1423794 -0.0000031 -0.0000806 -0.0000036 -0.0737307 -0.6076963 0.1900876 -0.0000847 0.1420383 -0.5767496 0.0002925 0.0001208 -0.0001007 -0.1940686 -0.6076833 -0.1900784 0.0000129 -0.1420256 -0.5767472 -0.0000164 0.000131 0.0003574 -0.1940649 1.8225799 -0.0000171 -0.0000601 -0.000013 1.0863909 -0.0003363 -0.0000046 -0.0002751 0.2077014 -0.8400781 0.0000036 0.0001015 -0.0000042 -0.1462015 0.0000396 -0.000177 0.0000251 0.0445416 0.4630691 -0.4831658 0.0000268 0.013861 0.793457 -0.0000164 -0.000085 -0.0000026 0.1208652 0.463089 0.4831676 0.0000714 -0.0138501 0.7933953 0.0000977 0.0000383 0.0000605 0.1208627 0.1470722 -0.6514123 -0.0000327 -0.6017319 0.7059368 -0.0000026 -0.0000468 -0.0000481 0.077463 0.147112 0.6514334 0.0000076 0.6017533 0.7058916 0.0000378 -0.0000182 0.0000783 0.0774613 1.2908934 -0.0000176 0.0000762 -0.0000222 0.228813 0.0000067 0.000115 0.0000072 0.1036121 unknown
polarizability: 118.2576943|-0.0003266|103.5401999|-0.0017906|-0.0030836|31.7230514 unknown
InChI: InChI=1S/C6F5NO2/c7-1-2(8)4(10)6(12(13)14)5(11)3(1)9
charge 0 multiplicity 1
14 atoms
F  -0.802886 2.461888 -0.000072
F  -0.802999 -2.461806 -0.000198
F  1.898599 -2.413246 -0.000043
F  1.898683 2.413215 0.000087
F  3.295945 -0.00004 0.000153
O  -3.025893 1.139174 -0.000056
O  -3.025837 -1.139163 0.000576
N  -2.427766 0.000018 -0.000302
C  -0.936308 0.000033 -0.00016
C  -0.201511 1.220295 -0.000075
C  -0.201552 -1.220245 -0.000127
C  1.207474 -1.21409 -0.000048
C  1.207517 1.214084 0.000022
C  1.916235 -0.000016 0.000043
