program: Gaussian 09
title: 000070164
version: EM64L-G09RevD.01
frameworkgroup: C1[X(C10H12O5)]
method: RPBEPBE
basis: SDD
operation: Freq
keyword: #pfreq=noraman
keyword: PBEPBE/SDD
title: #p freq=noraman PBEPBE/SDD
converged: YES YES NO NO
title: Mulliken charges:
elementType: O O O O O C C C C C C C C C C H H H H H H H H H H H H
charge: -0.344008 -0.287566 -0.441169 -0.286902 -0.267755 0.303178 0.301320 0.285990 0.006771 -0.511405 -0.488358 0.166235 -0.518255 -0.516706 -0.500765 0.283343 0.294281 0.391953 0.233230 0.234103 0.242110 0.213151 0.264202 0.230502 0.231760 0.240483 0.240277
chargesum: 0.00000
title: Mulliken charges with hydrogens summed into heavy atoms:
elementType: O O O O O C C C C C C C C C C
charge: -0.344008 -0.287566 -0.049216 -0.286902 -0.267755 0.303178 0.301320 0.285990 0.006771 -0.228062 -0.194076 0.166235 0.191189 0.191149 0.211755
polarizability: 1.86150462e+02 -1.80741602e+00 1.54938928e+02 -6.41845682e-01 1.21404221e+00 6.66672162e+01
1716.lowfreq: -6.6074 -3.5610 -0.0009 -0.0009 -0.0007 7.1834 45.0280 51.6940 71.8584
frequency: 44.9868 51.6830 71.8566 84.4740 107.0389 109.0763 120.5325 150.7586 171.5027 189.1941 214.7547 244.1075 270.6716 294.8912 303.9838 316.9308 345.4109 366.4938 427.2174 482.8581 531.0284 531.4188 559.0812 578.9952 641.7001 695.1883 726.1948 735.7681 761.3071 850.3782 863.0062 878.1428 907.3038 947.7857 1001.5394 1066.4493 1079.2481 1113.2385 1113.9190 1118.1946 1148.3227 1151.8716 1161.7266 1169.8164 1201.6865 1217.4348 1271.0337 1315.1318 1408.2095 1422.5641 1432.3636 1443.4649 1451.7957 1453.9743 1455.2109 1464.3418 1465.4252 1472.9828 1476.5250 1492.9038 1595.3150 1607.3256 1621.3814 2974.7219 2981.4872 3001.9861 3067.4998 3092.3435 3102.3144 3132.3525 3132.8793 3145.8731 3172.5649 3194.7361 3471.5884
redmass: 2.2136 5.3041 3.1250 2.4176 2.8213 1.5491 2.4312 2.3040 3.4109 1.9513 2.0359 3.2330 2.9182 5.1286 4.1923 6.4412 5.8091 5.8739 6.0483 6.5106 4.0537 1.2760 5.0370 5.1467 4.6256 6.0091 9.5035 3.4826 5.9355 7.2533 6.5348 1.4335 1.5285 7.9468 7.1474 4.3468 2.3699 1.2631 1.2399 1.2549 1.4905 1.5675 1.4422 3.1367 1.7465 2.3905 1.4993 5.8225 2.5962 1.2657 2.1342 1.3735 1.0502 1.7529 1.0955 1.0565 1.0488 1.1834 1.0555 2.9867 7.5417 7.8446 8.4029 1.0319 1.0346 1.0297 1.1047 1.0973 1.1043 1.1011 1.1053 1.1045 1.0916 1.0922 1.0641
irintensity: 6.2725 5.0402 3.6965 0.8890 1.7923 0.5940 0.3238 0.7956 5.9937 5.7675 4.3644 3.0032 0.6835 15.2780 7.6994 3.7070 1.1552 9.1509 6.3081 3.1129 19.0886 120.8349 5.5250 4.9395 9.2401 14.2783 20.5512 11.5904 28.1786 14.9034 37.9409 14.4715 29.3931 13.7150 108.6451 179.7203 81.5450 0.0631 5.5785 0.1268 77.5023 39.5315 35.6575 222.2366 122.8545 15.9365 287.7252 344.8556 110.4731 43.3649 7.3769 8.7357 13.4555 51.5447 22.6186 9.8945 15.1149 45.6631 33.4764 40.6099 279.8724 11.2161 70.5189 52.6978 77.6722 45.9644 37.4792 37.2455 29.0426 21.6172 13.6863 16.6278 3.7580 1.7438 116.3837
temp: 298.150 k
press: 1.00000 atm
elementType: 8 8 8 8 8 6 6 6 6 6 6 6 6 6 6 1 1 1 1 1 1 1 1 1 1 1 1
symmnumber: 1
zpe: 540948.1 jmol-1
zpe.correction: 0.206036 hartree
zpe.thermalcorrener: 0.221991 hartree
zpe.thermalcorrenthalpy: 0.222935 hartree
zpe.thermalcorrgfe: 0.162107 hartree
zpe.sumelectzpe: -763.218745 hartree
zpe.sumelectthermal: -763.202790 hartree
zpe.sumelectthermalent: -763.201846 hartree
zpe.sumelectthermalfe: -763.262674 hartree
dipole: 1.4469 1.5724 1.0262
dipole: 2.3705
quadrupole: -75.4640 -76.5325 -89.1150
quadrupole: 10.6575 2.7579 -3.3881
quadrupole: 4.9065 3.8380 -8.7445 10.6575 2.7579 -3.3881
hfenergy: -763.4247815 hartree
pointgroup: C01 [X(C10H12O5)]
dipole: 0.5524991 0.6086068 0.4405949 debye
polarizability: 185.369213|-2.64598|155.0761003|8.8784111|-0.202416|67.3112931 unknown
InChI: InChI=1S/C10H12O5/c1-13-7-4-6(10(12)15-3)5-8(14-2)9(7)11/h4-5,11H,1-3H3
charge 0 multiplicity 1
27 atoms
O  2.069659 2.114815 0.191106
O  1.315262 -2.667155 -0.108985
O  3.08237 -0.302875 0.088283
O  -3.2986 -0.857248 -0.244235
O  -3.15245 1.465543 -0.124816
C  -1.116595 0.122572 -0.064553
C  1.095587 1.095996 0.10682
C  0.854735 -1.348189 -0.011652
C  1.687969 -0.201685 0.07035
C  -0.29022 1.27551 0.038551
C  -0.546676 -1.170175 -0.083007
C  -2.583545 0.342508 -0.143187
C  1.599281 3.502653 0.185597
C  2.479089 -3.078383 0.705133
C  -4.76822 -0.711056 -0.333526
H  -0.765039 2.25999 0.057052
H  -1.181374 -2.055587 -0.155723
H  3.447422 0.6237 0.129973
H  0.953072 3.700618 1.061123
H  1.046033 3.725067 -0.746005
H  2.507019 4.120765 0.241491
H  2.282824 -2.895512 1.778918
H  3.391209 -2.544042 0.397656
H  2.575792 -4.158935 0.520616
H  -5.148865 -1.740175 -0.397637
H  -5.041877 -0.129266 -1.230046
H  -5.158463 -0.196854 0.561102
