program: Gaussian 09
title: 000070150
version: EM64L-G09RevD.01
frameworkgroup: C1[X(C12H18O)]
method: RPBEPBE
basis: SDD
operation: Freq
keyword: #pfreq=noraman
keyword: PBEPBE/SDD
title: #p freq=noraman PBEPBE/SDD
converged: NO YES NO NO
title: Mulliken charges:
elementType: O C C C C C C C C C C C C H H H H H H H H H H H H H H H H H H
charge: -0.426853 0.120228 0.564577 -0.702273 -0.702265 -0.748212 -0.622467 -0.636054 0.319928 0.365330 -0.040082 -0.871013 -0.799162 0.205003 0.214946 0.222576 0.214948 0.205003 0.222575 0.216114 0.216893 0.216880 0.229855 0.252387 0.230711 0.249066 0.230594 0.236706 0.236804 0.212354 0.364902
chargesum: 0.00000
title: Mulliken charges with hydrogens summed into heavy atoms:
elementType: O C C C C C C C C C C C C
charge: -0.061951 0.120228 0.564577 -0.059748 -0.059739 -0.098325 -0.392612 -0.383667 0.319928 0.365330 -0.040082 -0.160641 -0.113298
polarizability: 1.69755635e+02 -4.64651594e-01 1.43521190e+02 2.75351830e-03 5.13098781e-03 8.85803984e+01
1716.lowfreq: -12.0032 -3.0419 -2.8203 -0.0007 -0.0006 -0.0004 34.4403 85.5617 93.8689
frequency: 34.3309 85.5574 93.8476 135.4982 145.9148 171.4412 199.0239 224.1515 246.6216 254.9593 262.1971 287.9096 300.7350 305.8881 318.7372 319.6374 353.5749 405.4050 430.5843 478.4340 500.9988 525.7658 549.6445 566.0586 626.1889 711.9794 740.2004 805.0301 881.8018 896.5303 917.6510 921.6737 930.3924 936.0175 938.9200 990.2134 1019.7970 1021.9235 1024.5661 1042.6800 1047.1135 1117.9753 1170.7696 1206.6078 1208.2759 1220.5214 1251.4479 1281.0390 1325.9346 1371.6299 1372.6783 1381.5368 1397.5421 1399.1738 1401.8175 1417.9358 1442.5581 1456.3913 1457.4318 1463.7490 1468.4751 1477.1678 1477.5277 1480.7337 1484.2534 1495.5119 1500.0136 1611.5996 1621.5008 2948.8083 2968.8831 2970.1426 2976.0438 2980.4411 3015.5666 3057.7550 3062.9434 3064.8544 3068.8137 3074.1019 3076.3395 3078.3771 3084.1320 3088.8511 3114.6946 3144.4552 3580.5791
redmass: 2.8968 1.5287 1.6323 2.8071 1.0627 2.9918 1.0826 2.4842 1.1005 2.3975 3.2284 2.6774 3.8271 1.1487 1.0978 2.9734 2.4674 2.6883 3.4344 3.7267 3.1510 3.9552 3.1880 3.6600 3.6208 4.7908 3.2108 3.1841 1.5069 1.3784 1.6709 2.6621 2.3226 2.3357 1.2010 1.5686 1.4858 1.4712 1.3842 1.5129 1.5253 1.9937 1.8542 3.0261 2.6720 2.5933 2.0319 1.3675 4.7516 1.2253 1.1885 3.6492 1.3326 1.3238 1.2530 3.0103 1.7019 1.0458 1.0511 1.0485 1.0515 1.0441 1.0618 1.1747 1.0517 1.1977 1.3518 6.3334 6.4891 1.0401 1.0348 1.0348 1.0358 1.0364 1.0979 1.0968 1.0999 1.0999 1.1008 1.0984 1.0994 1.0993 1.0941 1.1001 1.0904 1.0901 1.0653
irintensity: 0.0306 0.1125 0.5244 0.9446 0.0831 0.3186 0.1165 11.5062 0.0610 0.9503 0.0004 0.3112 6.9208 103.7955 8.6766 0.0608 0.9324 0.6974 0.9931 1.0807 0.8333 1.7456 0.3482 8.3524 2.7729 11.3512 6.4209 10.8789 12.0832 4.5099 4.1880 1.9775 0.4299 17.8404 0.1688 17.0179 3.6976 21.4404 0.1243 6.2730 5.9965 52.9945 186.0173 7.4750 4.2670 8.3810 3.7830 27.3642 22.0705 24.5654 19.0817 2.5471 17.8987 18.0574 10.0370 0.2463 19.2222 10.9442 0.7394 0.3105 0.0301 12.2457 16.0217 19.6424 11.8835 2.6724 85.1836 1.9977 0.6290 45.1502 34.3865 36.6373 31.6007 32.4748 24.4618 17.7920 5.2878 13.1556 6.5399 127.8301 45.8362 40.9787 12.1335 20.2000 23.4339 10.9820 30.2778
temp: 298.150 k
press: 1.00000 atm
elementType: 8 6 6 6 6 6 6 6 6 6 6 6 6 1 1 1 1 1 1 1 1 1 1 1 1 1 1 1 1 1 1
symmnumber: 1
zpe: 699619.1 jmol-1
zpe.correction: 0.266471 hartree
zpe.thermalcorrener: 0.281407 hartree
zpe.thermalcorrenthalpy: 0.282351 hartree
zpe.thermalcorrgfe: 0.225779 hartree
zpe.sumelectzpe: -542.305431 hartree
zpe.sumelectthermal: -542.290495 hartree
zpe.sumelectthermalent: -542.289551 hartree
zpe.sumelectthermalfe: -542.346123 hartree
dipole: -0.0748 -1.6432 -0.0003
dipole: 1.6449
quadrupole: -76.1848 -73.6518 -83.4241
quadrupole: -6.6659 -0.0031 0.0015
quadrupole: 1.5687 4.1018 -5.6705 -6.6659 -0.0031 0.0015
hfenergy: -542.5719018 hartree
pointgroup: C01 [X(C12H18O1)]
dipole: -0.0288683 -0.6464919 0.0000239 debye
polarizability: 169.7563983|-0.4425512|143.5204252|0.0061904|-0.0086496|88.5803997 unknown
InChI: InChI=1S/C12H18O/c1-8-6-10(12(3,4)5)7-9(2)11(8)13/h6-7,13H,1-5H3
charge 0 multiplicity 1
31 atoms
O  3.412901 0.062741 0.000294
C  -2.392263 0.002226 -0.000003
C  -0.843623 0.028643 0.00002
C  -2.900737 -0.743795 1.270589
C  -2.900743 -0.744173 -1.270367
C  -3.007053 1.425589 -0.000207
C  -0.1149 -1.189952 0.000369
C  -0.094264 1.231603 -0.000312
C  1.296835 -1.22864 0.000428
C  1.32087 1.249417 -0.00023
C  1.999619 0.006764 0.000129
C  2.056176 -2.545348 0.000843
C  2.10746 2.543889 -0.000439
H  -4.006745 -0.785299 1.27635
H  -2.522416 -1.780902 1.312385
H  -2.567648 -0.225802 2.188561
H  -2.52249 -1.78132 -1.311818
H  -4.006752 -0.785617 -1.276147
H  -2.567599 -0.226501 -2.188499
H  -4.110189 1.35115 -0.000342
H  -2.709139 2.00024 0.896323
H  -2.708898 2.000083 -0.89676
H  -0.652603 -2.146431 0.000602
H  -0.611755 2.196421 -0.000684
H  2.700016 -2.659449 0.897269
H  1.356054 -3.397064 0.000478
H  2.700937 -2.659537 -0.894925
H  2.765872 2.61102 0.885436
H  2.771069 2.607521 -0.882631
H  1.432897 3.41707 -0.003997
H  3.796612 -0.848946 -0.000016
