program: Gaussian 09
title: 000070090
version: EM64L-G09RevD.01
frameworkgroup: C1[X(CCl2NO2P)]
method: RPBEPBE
basis: SDD
operation: Freq
keyword: #p
keyword: freq=noraman
keyword: PBEPBE/SDD
title: #p freq=noraman PBEPBE/SDD
converged: NO NO NO NO
title: Mulliken charges:
elementType: Cl Cl P O O N C
charge: -0.096865 -0.094200 0.917135 -0.457175 -0.119310 -0.302849 0.153264
chargesum: 0.00000
title: Mulliken charges with hydrogens summed into heavy atoms:
polarizability: 8.46876938e+01 -3.55116203e-01 6.83919690e+01 8.49186483e-01 -8.45652978e-02 5.44945680e+01
1716.lowfreq: -12.7368 -0.0023 0.0021 0.0024 7.7409 11.4100 62.2206 66.9275 136.2596
frequency: 62.1504 66.9144 136.2583 196.4950 223.5434 266.0562 282.4478 399.6576 462.4501 543.5759 547.6243 594.6029 1053.8620 1435.9256 2352.0200
redmass: 21.2251 18.0296 28.1242 16.5515 18.1416 20.4620 20.1777 21.2840 28.7206 12.7393 12.8019 21.4150 19.6451 14.8706 12.7078
irintensity: 0.2408 0.3091 0.9224 1.2447 16.2550 3.5754 0.9947 50.2302 172.4838 37.5833 48.8625 255.2693 92.4654 74.9735 1450.8088
temp: 298.150 k
press: 1.00000 atm
elementType: 17 17 15 8 8 7 6
symmnumber: 1
zpe: 51580.5 jmol-1
zpe.correction: 0.019646 hartree
zpe.thermalcorrener: 0.027901 hartree
zpe.thermalcorrenthalpy: 0.028845 hartree
zpe.thermalcorrgfe: -0.015406 hartree
zpe.sumelectzpe: -1504.119150 hartree
zpe.sumelectthermal: -1504.110895 hartree
zpe.sumelectthermalent: -1504.109951 hartree
zpe.sumelectthermalfe: -1504.154202 hartree
dipole: -1.1574 -0.0168 -1.0952
dipole: 1.5935
quadrupole: -65.8686 -60.4932 -65.2835
quadrupole: -0.0380 -2.9445 0.0152
quadrupole: -1.9869 3.3886 -1.4018 -0.0380 -2.9445 0.0152
hfenergy: -1504.1387962 hartree
pointgroup: C01 [X(C1Cl2N1O2P1)]
dipole: -0.4450026 0.028726 0.4406977 debye
dipolederiv: -0.2832528 0.0343234 -0.0000167 0.1409913 -0.7327949 0.1367817 -0.0586376 0.2400403 -0.2879407 -0.4028751 -0.1395417 -0.1066234 -0.2107486 -0.4750453 -0.1938794 -0.2251939 -0.2597953 -0.4194958 2.911258 -0.1707721 0.1135065 -0.1515181 2.1503702 0.0460377 -0.1071623 0.0937781 1.6537296 -0.6026314 0.0178664 -0.0665065 0.0043443 -0.5607636 0.0184847 0.0222356 -0.0019903 -0.5779823 -1.5127503 0.2272788 0.2026138 0.2065997 -0.2359223 -0.0314222 0.3104128 -0.052677 -0.2524682 -2.8952431 0.431124 0.2549091 0.3660052 -0.6323265 -0.0321774 0.6409467 -0.1133834 -0.6683784 2.7854948 -0.4002788 -0.3978829 -0.3556738 0.4864825 0.0561748 -0.5826012 0.0940275 0.5525357 unknown
polarizability: 84.2327068|-2.5357914|68.5146958|-1.2950335|2.1477169|54.8268282 unknown
InChI: InChI=1S/CClNO2P.Cl/c2-6(5)3-1-4;
charge 0 multiplicity 1
7 atoms
Cl 1.281264 -2.14833 0.486329
Cl 2.010889 1.231633 1.000731
P  0.926903 -0.124652 -0.406919
O  1.326141 0.021821 -1.926894
O  -3.014344 0.521153 0.55195
N  -0.676752 0.160087 0.013382
C  -1.854101 0.338187 0.281422
