program: Orca
programVersion: 5.0.4
elementType: N O O H H O H H
charge: 1
multiplicity: 1
keywords: wB97X-D3BJ Opt Freq def2-TZVPP def2/J RIJCOSX VeryTightSCF
keywords: PAL8 VeryTightOpt defgrid3
frequency: 0.00 0.00 0.00 0.00 0.00 0.00 49.20 62.10 131.46 219.91 288.08 302.59 373.99 394.30 498.04 680.61 997.22 1620.00 1663.51 2310.96 3089.18 3827.34 3846.59 3933.21
frequency: 49.20 62.10 131.46 219.91 288.08 302.59 373.99 394.30 498.04 680.61 997.22 1620.00 1663.51 2310.96 3089.18 3827.34 3846.59 3933.21
formula: H4NO3
InChI: InChI=1/NO.2H2O/c1-2;;/h;2*1H2
8 atoms
N  -4.594825 -0.225867 0.924222
O  -3.76494 0.431981 0.726413
O  -6.078624 0.214653 -0.294071
H  -6.367017 1.129458 -0.407579
H  -6.878648 -0.35849 -0.101578
O  -8.046935 -1.41027 0.194806
H  -8.786012 -1.288191 0.796936
H  -8.344351 -2.022363 -0.484485
totalener: -282.56647864 hartree
nucrepener: 109.26866600 hartree
electener: -391.83514464 hartree
oneelecener: -595.57695307 hartree
twoeener: 203.74180842 hartree
kineticenergy: 281.03159477 hartree
exchangeener: -22.282812670649 hartree
correlationener: -1.457763979593 hartree
xcener: -23.740576650242 hartree
dispersion: -0.004181494 hartree
temp: 298.15 k
press: 1.00 atm
thermalcorrenthalpy: 0.00094421 hartree
totalenthalpy: -282.51101449 hartree
vibrat: 0.00444699 hartree
rotat: 0.01236015 hartree
transl: 0.01828353 hartree
total: 0.03509067 hartree
totalentropycorr: -0.03509067 hartree
gibbsenthalpy: -282.54610515 hartree
gibbsminuselec: 0.02455498 hartree
dispersion: -0.004236763 hartree
dispersion: -0.004230785 hartree
dispersion: -0.004271864 hartree
dispersion: -0.004353134 hartree
dispersion: -0.004461489 hartree
dispersion: -0.004514008 hartree
dispersion: -0.004550260 hartree
dispersion: -0.004554318 hartree
dispersion: -0.004522144 hartree
dispersion: -0.004577605 hartree
dispersion: -0.004536153 hartree
dispersion: -0.004560286 hartree
dispersion: -0.004569749 hartree
dispersion: -0.004576562 hartree
dispersion: -0.004584314 hartree
dispersion: -0.004588311 hartree
dispersion: -0.004589748 hartree
dispersion: -0.004583695 hartree
dispersion: -0.004572319 hartree
dispersion: -0.004563456 hartree
dispersion: -0.004553179 hartree
dispersion: -0.004550017 hartree
dispersion: -0.004545257 hartree
dispersion: -0.004549084 hartree
dispersion: -0.004550810 hartree
dispersion: -0.004549635 hartree
dispersion: -0.004555191 hartree
dispersion: -0.004554134 hartree
dispersion: -0.004557641 hartree
dispersion: -0.004561316 hartree
dispersion: -0.004573773 hartree
dispersion: -0.004595000 hartree
dispersion: -0.004617611 hartree
dispersion: -0.004637793 hartree
dispersion: -0.004653350 hartree
dispersion: -0.004660355 hartree
dispersion: -0.004655507 hartree
dispersion: -0.004650900 hartree
dispersion: -0.004649870 hartree
dispersion: -0.004650551 hartree
dispersion: -0.004651380 hartree
dispersion: -0.004651550 hartree
dispersion: -0.004651896 hartree
dispersion: -0.004653523 hartree
dispersion: -0.004654777 hartree
dispersion: -0.004655988 hartree
dispersion: -0.004656095 hartree
dispersion: -0.004655935 hartree
dispersion: -0.004656191 hartree
dispersion: -0.004656400 hartree
dispersion: -0.004656481 hartree
dispersion: -0.004656607 hartree
dispersion: -0.004656728 hartree
dispersion: -0.004656816 hartree
dispersion: -0.004656896 hartree
dispersion: -0.004656958 hartree
dispersion: -0.004657066 hartree
dispersion: -0.004657106 hartree
dispersion: -0.004657155 hartree
dispersion: -0.004657270 hartree
dispersion: -0.004657338 hartree
dispersion: -0.004657358 hartree
dispersion: -0.004657434 hartree
dispersion: -0.004657465 hartree
dispersion: -0.004657601 hartree
dispersion: -0.004657650 hartree
dispersion: -0.004657662 hartree
dispersion: -0.004657646 hartree
dispersion: -0.004657668 hartree
dispersion: -0.004657924 hartree
dispersion: -0.004657939 hartree
dispersion: -0.004657617 hartree
dispersion: -0.004657419 hartree
dispersion: -0.004657496 hartree
dispersion: -0.004657521 hartree
dispersion: -0.004657440 hartree
dispersion: -0.004657437 hartree
dispersion: -0.004657430 hartree
dispersion: -0.004657495 hartree
dispersion: -0.004657613 hartree
dispersion: -0.004657744 hartree
dispersion: -0.004657791 hartree
dispersion: -0.004657817 hartree
dispersion: -0.004657886 hartree
dispersion: -0.004657920 hartree
dispersion: -0.004658130 hartree
dispersion: -0.004658132 hartree
dispersion: -0.004658133 hartree
dispersion: -0.004657773 hartree
dispersion: -0.004657936 hartree
dispersion: -0.004657874 hartree
dispersion: -0.004657797 hartree
dispersion: -0.004657808 hartree
dispersion: -0.004658115 hartree
dispersion: -0.004658129 hartree
dispersion: -0.004658042 hartree
dispersion: -0.004658039 hartree
dispersion: -0.004657967 hartree
dispersion: -0.004657979 hartree
dispersion: -0.004658209 hartree
dispersion: -0.004658253 hartree
dispersion: -0.004658188 hartree
dispersion: -0.004658215 hartree
dispersion: -0.004658349 hartree
dispersion: -0.004658381 hartree
dispersion: -0.004658293 hartree
dispersion: -0.004658292 hartree
dispersion: -0.004658181 hartree
dispersion: -0.004658040 hartree
dispersion: -0.004658556 hartree
dispersion: -0.004659220 hartree
dispersion: -0.004659369 hartree
dispersion: -0.004659547 hartree
dispersion: -0.004659599 hartree
dispersion: -0.004659680 hartree
dispersion: -0.004659745 hartree
dispersion: -0.004659770 hartree
dispersion: -0.004659784 hartree
dispersion: -0.004659726 hartree
dispersion: -0.004659711 hartree
dispersion: -0.004659682 hartree
dispersion: -0.004659555 hartree
dispersion: -0.004660003 hartree
dispersion: -0.004659975 hartree
dispersion: -0.004659910 hartree
dispersion: -0.004659863 hartree
dispersion: -0.004659861 hartree
dispersion: -0.004659879 hartree
dispersion: -0.004659935 hartree
dispersion: -0.004659911 hartree
dispersion: -0.004659917 hartree
dispersion: -0.004659916 hartree
dispersion: -0.004660031 hartree
dispersion: -0.004660153 hartree
dispersion: -0.004660176 hartree
dispersion: -0.004660137 hartree
dispersion: -0.004660144 hartree
dispersion: -0.004660210 hartree
dispersion: -0.004660289 hartree
dispersion: -0.004660406 hartree
dispersion: -0.004660403 hartree
dispersion: -0.004660367 hartree
dispersion: -0.004660374 hartree
dispersion: -0.004660493 hartree
dispersion: -0.004660606 hartree
dispersion: -0.004660466 hartree
dispersion: -0.004660424 hartree
dispersion: -0.004660447 hartree
dispersion: -0.004660630 hartree
dispersion: -0.004660644 hartree
dispersion: -0.004660601 hartree
dispersion: -0.004661010 hartree
dispersion: -0.004661569 hartree
dispersion: -0.004661578 hartree
dispersion: -0.004661228 hartree
dispersion: -0.004661173 hartree
dispersion: -0.004661179 hartree
dispersion: -0.004661114 hartree
dispersion: -0.004660655 hartree
dispersion: -0.004660573 hartree
dispersion: -0.004660422 hartree
dispersion: -0.004659965 hartree
dispersion: -0.004659905 hartree
dispersion: -0.004659898 hartree
dispersion: -0.004659884 hartree
dispersion: -0.004659868 hartree
dispersion: -0.004659766 hartree
dispersion: -0.004659632 hartree
dispersion: -0.004659586 hartree
dispersion: -0.004659553 hartree
dispersion: -0.004659514 hartree
dispersion: -0.004659496 hartree
dispersion: -0.004659470 hartree
dispersion: -0.004659459 hartree
dispersion: -0.004659506 hartree
dispersion: -0.004659420 hartree
dispersion: -0.004659233 hartree
dispersion: -0.004659158 hartree
dispersion: -0.004659010 hartree
dispersion: -0.004658897 hartree
dispersion: -0.004658603 hartree
dispersion: -0.004658439 hartree
dispersion: -0.004658120 hartree
dispersion: -0.004658309 hartree
dispersion: -0.004661739 hartree
dispersion: -0.004656684 hartree
dispersion: -0.004657852 hartree
dispersion: -0.004658550 hartree
dispersion: -0.004658407 hartree
dispersion: -0.004658337 hartree
dispersion: -0.004658431 hartree
dispersion: -0.004658591 hartree
dispersion: -0.004658126 hartree
dispersion: -0.004658067 hartree
dispersion: -0.004658350 hartree
dispersion: -0.004658284 hartree
dispersion: -0.004658158 hartree
dispersion: -0.004658225 hartree
dispersion: -0.004657472 hartree
dispersion: -0.004657810 hartree
dispersion: -0.004656925 hartree
dispersion: -0.004657223 hartree
dispersion: -0.004657611 hartree
dispersion: -0.004657854 hartree
dispersion: -0.004657885 hartree
dispersion: -0.004656841 hartree
dispersion: -0.004657275 hartree
dispersion: -0.004657454 hartree
dispersion: -0.004657849 hartree
dispersion: -0.004658023 hartree
dispersion: -0.004657369 hartree
dispersion: -0.004657651 hartree
dispersion: -0.004657821 hartree
dispersion: -0.004657851 hartree
dispersion: -0.004656818 hartree
dispersion: -0.004657431 hartree
dispersion: -0.004657661 hartree
dispersion: -0.004657663 hartree
dispersion: -0.004656435 hartree
dispersion: -0.004657038 hartree
dispersion: -0.004657265 hartree
dispersion: -0.004656408 hartree
dispersion: -0.004656836 hartree
dispersion: -0.004657389 hartree
energy: -535.8454 -529.0940 -528.0294 -406.0226 -47.9563 -37.1165 -36.1862 -29.8467 -26.5218 -26.3274 -25.1630 -23.6848 -22.7064 -19.9941 -18.5992 -17.6934 -16.8456 -7.3906 -6.6104 -1.7233 -0.7897 0.8670 1.8032 2.6421 4.4796 4.5866 6.2726 6.4595 6.5972 7.4463 8.1828 9.2198 9.6122 10.0217 10.3829 10.5018 11.3522 11.9176 12.3205 12.7222 13.3050 14.1908 15.9116 16.3226 16.8394 18.9892 19.3395 20.2194 22.2619 23.9590 25.7362 26.4909 27.0235 27.4417 29.3307 30.1239 30.5918 31.2946 32.8003 36.0448 37.0486 37.6450 38.2729 43.5151 43.8960 45.1307 45.6937 46.4391 47.0444 47.3584 47.9479 48.4255 49.4118 49.6316 50.2347 51.8055 52.8717 54.3900 55.1888 56.8009 57.9260 60.2637 62.9476 65.0052 67.9438 68.3213 69.2062 70.5520 73.7707 76.6440 79.5025 82.7236 83.7076 84.8218 85.8737 86.2008 86.9320 87.3684 88.1839 88.7117 89.6986 89.9395 92.5115 94.6095 96.2284 96.7120 97.2506 97.5505 98.3039 98.7786 99.1629 99.3722 100.7120 102.4047 103.6797 104.2051 104.4655 105.5084 106.7239 108.7477 109.2778 109.8220 110.6766 110.7194 113.6843 115.2227 116.1777 120.3875 121.8516 122.9464 123.6321 123.8168 124.5198 127.0594 128.7599 128.8546 129.8686 132.5035 132.6829 133.1101 135.1595 137.7546 149.0845 149.2259 149.9563 155.6946 158.7954 162.4064 163.1067 165.2726 169.2969 171.2295 171.3501 173.1305 173.3385 174.4910 175.7550 176.0463 177.8156 178.3050 179.9568 180.9504 182.6093 185.3285 185.4034 185.7966 185.9169 187.9276 190.6288 193.6415 195.5771 197.8913 201.0743 201.6540 205.1980 207.5681 860.5970 1182.5648 1184.8539 1191.5939 electronvolt
chargesum: 1.0000000
charge: 0.500391 0.212640 -0.394656 0.272376 0.291341 -0.414704 0.263640 0.268973
charge: 0.254693 0.430432 0.369962 -0.094237 -0.176837 0.402351 -0.094987 -0.091375
qa: 0.5004 0.2126 -0.3947 0.2724 0.2913 -0.4147 0.2636 0.2690
va: 2.8159 2.5761 2.1671 0.9841 1.0454 2.1258 0.9944 0.9909
dispersion: -0.004657672 hartree
energy: -282.643862706202 hartree
dipole: -6.83665 6.68463 -0.15202 -1.36201 1.63890 0.27689 -1.48199 1.82430 0.34231
magnitude: 0.46578 au
magnitude: 1.18391 debye
zeropoint: 0.05533279 hartree
thermalvibcorrection: 0.00474460 hartree
thermalrotcorrection: 0.00141627 hartree
thermaltrasncorrection: 0.00141627 hartree
thermaltotal: -282.58095278 hartree
thermalcorr: 0.00757714 hartree
nonthermalcorr: 0.05533279 hartree
totalcorr: 0.06290993 hartree
totalenthalpy: -282.58000857 hartree
vibrat: 0.00852919 hartree
rotat: 0.01209777 hartree
total: 0.03891049 hartree
