program: Orca
programVersion: 5.0.4
elementType: H C C H C H C H C H C H O H H H O H H
charge: 1
multiplicity: 1
keywords: wB97X-D3BJ Opt Freq def2-TZVPP def2/J RIJCOSX VeryTightSCF
keywords: PAL8 VeryTightOpt defgrid3
frequency: 0.00 0.00 0.00 0.00 0.00 0.00 15.00 19.23 30.43 30.86 73.60 77.04 135.77 155.51 222.72 224.14 238.75 282.27 340.28 349.89 469.58 595.58 601.38 669.30 839.14 854.68 940.78 1015.14 1016.47 1033.24 1039.56 1069.70 1094.28 1158.95 1183.89 1209.19 1214.37 1269.33 1378.92 1456.95 1489.14 1502.86 1615.79 1649.09 1650.81 1677.86 2839.39 2856.60 3205.45 3218.78 3219.97 3239.77 3242.31 3854.53 3854.79 3945.45 3945.76
frequency: 15.00 19.23 30.43 30.86 73.60 77.04 135.77 155.51 222.72 224.14 238.75 282.27 340.28 349.89 469.58 595.58 601.38 669.30 839.14 854.68 940.78 1015.14 1016.47 1033.24 1039.56 1069.70 1094.28 1158.95 1183.89 1209.19 1214.37 1269.33 1378.92 1456.95 1489.14 1502.86 1615.79 1649.09 1650.81 1677.86 2839.39 2856.60 3205.45 3218.78 3219.97 3239.77 3242.31 3854.53 3854.79 3945.45 3945.76
formula: C6H11O2
InChI: InChI=1/C6H7.2H2O/c1-2-4-6-5-3-1;;/h1-5H,6H2;2*1H2
19 atoms
H  0.290708 -2.141447 -0.52097
C  -0.231836 -1.217132 -0.300726
C  0.335387 0.021998 -0.798628
H  0.513152 -0.034542 -1.898013
C  -0.374419 1.248398 -0.487088
H  0.033646 2.181457 -0.859664
C  -1.526179 1.23266 0.247479
H  -2.058134 2.145615 0.48074
C  -2.019607 -0.000917 0.699734
H  -2.935242 -0.009801 1.283117
C  -1.384362 -1.223618 0.432708
H  -1.80834 -2.145871 0.807634
O  3.268947 -0.086263 0.18993
H  4.038761 -0.368606 -0.310071
H  3.612381 0.207199 1.0375
H  1.400896 0.093304 -0.474172
O  0.747495 0.209462 -3.86508
H  0.135026 -0.0505 -4.55771
H  1.54742 0.477983 -4.323717
totalener: -385.70056191 hartree
nucrepener: 358.52130583 hartree
electener: -744.22186774 hartree
oneelecener: -1223.35203574 hartree
twoeener: 479.13016800 hartree
kineticenergy: 384.11970855 hartree
exchangeener: -34.533168112407 hartree
correlationener: -2.557257541415 hartree
xcener: -37.090425653822 hartree
dispersion: -0.027937829 hartree
temp: 298.15 k
press: 1.00 atm
thermalcorrenthalpy: 0.00094421 hartree
totalenthalpy: -385.55894617 hartree
vibrat: 0.01229175 hartree
rotat: 0.01400884 hartree
transl: 0.01907105 hartree
total: 0.04537164 hartree
totalentropycorr: -0.04537164 hartree
gibbsenthalpy: -385.60431781 hartree
gibbsminuselec: 0.12418193 hartree
dispersion: -0.027515087 hartree
dispersion: -0.027463013 hartree
dispersion: -0.027198087 hartree
dispersion: -0.027098603 hartree
dispersion: -0.026885243 hartree
dispersion: -0.026875514 hartree
dispersion: -0.027109484 hartree
dispersion: -0.027061351 hartree
dispersion: -0.027029700 hartree
dispersion: -0.026945462 hartree
dispersion: -0.026912641 hartree
dispersion: -0.026895944 hartree
dispersion: -0.026888718 hartree
dispersion: -0.026831682 hartree
dispersion: -0.026779494 hartree
dispersion: -0.026769095 hartree
dispersion: -0.026776492 hartree
dispersion: -0.026822442 hartree
dispersion: -0.026888795 hartree
dispersion: -0.026964716 hartree
dispersion: -0.027027537 hartree
dispersion: -0.027011498 hartree
dispersion: -0.026983242 hartree
dispersion: -0.026841247 hartree
dispersion: -0.026868391 hartree
dispersion: -0.026866004 hartree
dispersion: -0.026800962 hartree
dispersion: -0.026832472 hartree
dispersion: -0.026874577 hartree
dispersion: -0.026826568 hartree
dispersion: -0.026812860 hartree
dispersion: -0.026815209 hartree
dispersion: -0.026802661 hartree
dispersion: -0.026888466 hartree
dispersion: -0.026781415 hartree
dispersion: -0.026924063 hartree
dispersion: -0.026846634 hartree
dispersion: -0.026841508 hartree
dispersion: -0.026848412 hartree
dispersion: -0.026854167 hartree
dispersion: -0.026855117 hartree
dispersion: -0.026854087 hartree
dispersion: -0.026852226 hartree
dispersion: -0.026856484 hartree
dispersion: -0.026854846 hartree
dispersion: -0.026857059 hartree
dispersion: -0.026862171 hartree
dispersion: -0.026858571 hartree
dispersion: -0.026869960 hartree
dispersion: -0.026870436 hartree
dispersion: -0.026878623 hartree
dispersion: -0.026886563 hartree
dispersion: -0.026894230 hartree
dispersion: -0.026898969 hartree
dispersion: -0.026899688 hartree
dispersion: -0.026892526 hartree
dispersion: -0.026886734 hartree
dispersion: -0.026885429 hartree
dispersion: -0.026884939 hartree
dispersion: -0.026884295 hartree
dispersion: -0.026882566 hartree
dispersion: -0.026879989 hartree
dispersion: -0.026877867 hartree
dispersion: -0.026876013 hartree
dispersion: -0.026875413 hartree
dispersion: -0.026875287 hartree
dispersion: -0.026875568 hartree
dispersion: -0.026875765 hartree
dispersion: -0.026875617 hartree
dispersion: -0.026875458 hartree
dispersion: -0.026875988 hartree
dispersion: -0.026876440 hartree
dispersion: -0.026875791 hartree
dispersion: -0.026874942 hartree
dispersion: -0.026874512 hartree
dispersion: -0.026874547 hartree
dispersion: -0.026874117 hartree
dispersion: -0.026874207 hartree
dispersion: -0.026874322 hartree
chargesum: 1.0000000
charge: 0.172406 0.001074 -0.032508 0.150362 -0.000126 0.172793 -0.155706 0.175764 0.047564 0.183488 -0.155592 0.175751 -0.424272 0.240924 0.241119 0.149814 -0.424524 0.240994 0.240674
charge: 0.046589 0.144229 0.006355 0.072425 0.144343 0.046705 0.019215 0.039300 0.145877 0.051645 0.019262 0.039312 0.304881 -0.114437 -0.114312 0.073417 0.304235 -0.114422 -0.114618
qa: 0.1724 0.0011 -0.0325 0.1504 -0.0001 0.1728 -0.1557 0.1758 0.0476 0.1835 -0.1556 0.1758 -0.4243 0.2409 0.2411 0.1498 -0.4245 0.2410 0.2407
va: 0.9877 3.9042 3.7473 1.1133 3.9054 0.9878 3.9781 0.9938 3.8769 0.9815 3.9786 0.9938 2.0685 1.0118 1.0115 1.1146 2.0682 1.0116 1.0119
dispersion: -0.026874040 hartree
energy: -385.735244412222 hartree
dipole: 3.94174 -3.71997 0.22178 0.05911 -0.05988 -0.00076 -2.45920 2.33306 -0.12613
magnitude: 0.25514 au
magnitude: 0.64851 debye
zeropoint: 0.15790955 hartree
thermalvibcorrection: 0.01033763 hartree
thermalrotcorrection: 0.00141627 hartree
thermaltrasncorrection: 0.00141627 hartree
thermaltotal: -385.56416468 hartree
thermalcorr: 0.01317018 hartree
nonthermalcorr: 0.15790955 hartree
totalcorr: 0.17107973 hartree
totalenthalpy: -385.56322047 hartree
vibrat: 0.02005341 hartree
rotat: 0.01414545 hartree
total: 0.05326991 hartree
