program: Orca
programVersion: 5.0.4
elementType: H C C H C H C H C H C H O N O H H
charge: 1
multiplicity: 1
keywords: UKS wB97X-D3BJ Opt Freq def2-TZVPP def2/J RIJCOSX VeryTightSCF
keywords: PAL8 VeryTightOpt defgrid3
frequency: 0.00 0.00 0.00 0.00 0.00 0.00 24.53 53.20 80.23 123.70 146.77 186.48 202.36 221.94 251.13 323.21 381.58 398.41 409.92 611.74 614.50 695.12 742.84 898.66 938.75 1025.61 1032.25 1043.98 1047.48 1058.80 1066.90 1082.91 1187.92 1206.87 1211.49 1354.51 1397.18 1518.43 1541.44 1631.80 1647.91 1667.46 2247.25 3208.88 3214.72 3219.89 3227.53 3232.96 3240.02 3844.25 3933.77
frequency: 24.53 53.20 80.23 123.70 146.77 186.48 202.36 221.94 251.13 323.21 381.58 398.41 409.92 611.74 614.50 695.12 742.84 898.66 938.75 1025.61 1032.25 1043.98 1047.48 1058.80 1066.90 1082.91 1187.92 1206.87 1211.49 1354.51 1397.18 1518.43 1541.44 1631.80 1647.91 1667.46 2247.25 3208.88 3214.72 3219.89 3227.53 3232.96 3240.02 3844.25 3933.77
formula: C6H8NO2
InChI: InChI=1/C6H6.NO.H2O/c1-2-4-6-5-3-1;1-2;/h1-6H;;1H2
17 atoms
H  1.278497 -0.203807 2.257479
C  0.826108 -0.054652 1.284774
C  -0.545068 0.196619 1.186405
H  -1.144933 0.250768 2.087596
C  -1.164632 0.32379 -0.062273
H  -2.236919 0.464589 -0.120785
C  -0.400928 0.272255 -1.212036
H  -0.862229 0.370994 -2.187405
C  0.992318 0.114967 -1.111213
H  1.59593 0.082899 -2.010735
C  1.597034 -0.100187 0.138626
H  2.664132 -0.273056 0.193946
O  0.531588 2.712286 0.314802
N  1.09487 2.46261 -0.573131
O  3.428961 2.737108 0.130369
H  4.0610 3.092872 -0.500378
H  3.89521 2.710858 0.970488
totalener: -438.58581371 hartree
nucrepener: 420.67077816 hartree
electener: -859.25659187 hartree
oneelecener: -1416.37929724 hartree
twoeener: 557.12270537 hartree
kineticenergy: 436.89653863 hartree
exchangeener: -38.520521137298 hartree
correlationener: -2.758935765795 hartree
xcener: -41.279456903093 hartree
s2: -0.000000
dispersion: -0.031050928 hartree
temp: 298.15 k
press: 1.00 atm
thermalcorrenthalpy: 0.00094421 hartree
totalenthalpy: -438.47374411 hartree
vibrat: 0.01304194 hartree
rotat: 0.01390613 hartree
transl: 0.01920008 hartree
total: 0.04614815 hartree
totalentropycorr: -0.04614815 hartree
gibbsenthalpy: -438.51989226 hartree
gibbsminuselec: 0.09697238 hartree
s2: 0.000000
dispersion: -0.030968826 hartree
dispersion: -0.030931683 hartree
dispersion: -0.030914433 hartree
dispersion: -0.030910978 hartree
dispersion: -0.030913939 hartree
dispersion: -0.030926503 hartree
dispersion: -0.030932183 hartree
dispersion: -0.030970360 hartree
dispersion: -0.030956636 hartree
dispersion: -0.030961882 hartree
dispersion: -0.031038834 hartree
dispersion: -0.031033070 hartree
dispersion: -0.031034837 hartree
dispersion: -0.031034608 hartree
dispersion: -0.031031421 hartree
dispersion: -0.031030217 hartree
dispersion: -0.031031844 hartree
dispersion: -0.031033207 hartree
dispersion: -0.031032717 hartree
dispersion: -0.031032556 hartree
dispersion: -0.031032359 hartree
dispersion: -0.031032616 hartree
dispersion: -0.031031910 hartree
dispersion: -0.031031512 hartree
dispersion: -0.031030021 hartree
dispersion: -0.031032398 hartree
dispersion: -0.031032505 hartree
dispersion: -0.031037430 hartree
dispersion: -0.031039358 hartree
dispersion: -0.031043470 hartree
dispersion: -0.031046556 hartree
dispersion: -0.031051722 hartree
dispersion: -0.031057093 hartree
dispersion: -0.031069692 hartree
dispersion: -0.031082374 hartree
dispersion: -0.031092679 hartree
dispersion: -0.031107115 hartree
dispersion: -0.031121461 hartree
dispersion: -0.031134335 hartree
dispersion: -0.031155163 hartree
dispersion: -0.031102525 hartree
dispersion: -0.031124331 hartree
dispersion: -0.031199276 hartree
dispersion: -0.031195785 hartree
dispersion: -0.031212029 hartree
dispersion: -0.031225546 hartree
dispersion: -0.031221745 hartree
dispersion: -0.031216328 hartree
dispersion: -0.031213653 hartree
dispersion: -0.031214381 hartree
totalenthalpy: -438.47699510 hartree
vibrat: 0.01134051 hartree
rotat: 0.01386143 hartree
total: 0.04440202 hartree
dispersion: -0.031247850 hartree
dispersion: -0.031299069 hartree
dispersion: -0.031353191 hartree
dispersion: -0.031387956 hartree
dispersion: -0.031437747 hartree
dispersion: -0.031499069 hartree
dispersion: -0.031584525 hartree
dispersion: -0.031662242 hartree
dispersion: -0.031756548 hartree
dispersion: -0.031818513 hartree
dispersion: -0.031834968 hartree
dispersion: -0.031853404 hartree
dispersion: -0.031872422 hartree
dispersion: -0.031884117 hartree
dispersion: -0.031889414 hartree
dispersion: -0.031885753 hartree
dispersion: -0.031892551 hartree
dispersion: -0.031888206 hartree
dispersion: -0.031893387 hartree
dispersion: -0.031894366 hartree
dispersion: -0.031894478 hartree
dispersion: -0.031892699 hartree
dispersion: -0.031893885 hartree
dispersion: -0.031893700 hartree
dispersion: -0.031892998 hartree
chargesum: 1.0000000
charge: 0.169230 -0.087380 -0.136979 0.168761 -0.104058 0.173708 -0.123062 0.174553 -0.144393 0.197377 -0.110861 0.152071 0.187153 0.433567 -0.465292 0.261174 0.254432
charge: 0.034459 0.000412 0.034140 0.038224 0.003548 0.035875 0.000586 0.035051 0.007815 0.034596 0.004781 0.032600 0.419426 0.245238 0.290886 -0.107466 -0.110170
qa: 0.1692 -0.0874 -0.1370 0.1688 -0.1041 0.1737 -0.1231 0.1746 -0.1444 0.1974 -0.1109 0.1521 0.1872 0.4336 -0.4653 0.2612 0.2544
va: 0.9955 3.9259 3.8980 0.9986 3.9348 0.9950 3.9202 0.9980 3.8755 0.9876 3.8822 1.0225 2.5721 2.8483 2.0264 0.9976 0.9986
dispersion: -0.031893270 hartree
energy: -438.621389810012 hartree
dipole: 2.54421 -1.86129 0.68292 -2.01741 3.14538 1.12797 0.50247 -0.53502 -0.03256
magnitude: 1.31900 au
magnitude: 3.35262 debye
zeropoint: 0.13303874 hartree
thermalvibcorrection: 0.00822502 hartree
thermalrotcorrection: 0.00141627 hartree
thermaltrasncorrection: 0.00141627 hartree
thermaltotal: -438.47729351 hartree
thermalcorr: 0.01105756 hartree
nonthermalcorr: 0.13303874 hartree
totalcorr: 0.14409630 hartree
totalenthalpy: -438.47634930 hartree
vibrat: 0.01494027 hartree
rotat: 0.01375267 hartree
total: 0.04789301 hartree
