program: Orca
programVersion: 5.0.4
elementType: H C C H C H C H C H C H O N O H H
charge: 1
multiplicity: 3
keywords: UKS wB97X-D3BJ Opt Freq def2-TZVPP def2/J RIJCOSX VeryTightSCF
keywords: PAL8 VeryTightOpt defgrid3
frequency: 0.00 0.00 0.00 0.00 0.00 0.00 -47.63 7.58 34.35 38.51 63.05 67.49 76.73 140.49 151.97 241.72 253.67 304.91 311.10 336.94 424.14 606.59 702.43 873.62 923.23 951.66 975.01 1001.89 1019.04 1048.41 1050.98 1068.77 1097.56 1197.12 1214.10 1379.53 1394.92 1414.66 1477.79 1552.34 1621.84 1655.08 2056.81 3217.84 3227.21 3227.88 3233.99 3245.29 3247.80 3850.66 3938.88
frequency: 7.58 34.35 38.51 63.05 67.49 76.73 140.49 151.97 241.72 253.67 304.91 311.10 336.94 424.14 606.59 702.43 873.62 923.23 951.66 975.01 1001.89 1019.04 1048.41 1050.98 1068.77 1097.56 1197.12 1214.10 1379.53 1394.92 1414.66 1477.79 1552.34 1621.84 1655.08 2056.81 3217.84 3227.21 3227.88 3233.99 3245.29 3247.80 3850.66 3938.88
formula: C6H8NO2
InChI: InChI=1/C6H6.NO.H2O/c1-2-4-6-5-3-1;1-2;/h1-6H;;1H2
17 atoms
H  0.846119 -0.349854 2.492577
C  0.551796 -0.164112 1.468245
C  -0.706397 -0.50099 1.019811
H  -1.427144 -0.959431 1.687134
C  -1.097254 -0.25252 -0.348947
H  -2.097471 -0.53353 -0.658673
C  -0.222008 0.329253 -1.24655
H  -0.518943 0.513464 -2.2704
C  1.040451 0.671244 -0.799797
H  1.775331 1.138026 -1.445221
C  1.432286 0.422459 0.571288
H  2.434313 0.719408 0.858769
O  0.281533 4.534346 0.90402
N  0.564769 3.464364 0.635044
O  3.913445 1.856362 -0.630668
H  4.740872 1.481774 -0.944245
H  4.099243 2.790648 -0.505855
totalener: -438.54912079 hartree
nucrepener: 387.89399889 hartree
electener: -826.44311968 hartree
oneelecener: -1352.04424646 hartree
twoeener: 525.60112678 hartree
kineticenergy: 436.83667887 hartree
exchangeener: -38.527594635859 hartree
correlationener: -2.734504621525 hartree
xcener: -41.262099257385 hartree
s2: 2.025843
dispersion: -0.027150938 hartree
temp: 298.15 k
press: 1.00 atm
thermalcorrenthalpy: 0.00094421 hartree
totalenthalpy: -438.43561858 hartree
vibrat: 0.01841339 hartree
rotat: 0.01429608 hartree
transl: 0.01920008 hartree
total: 0.05294684 hartree
totalentropycorr: -0.05294684 hartree
gibbsenthalpy: -438.48856542 hartree
gibbsminuselec: 0.08770631 hartree
s2: 2.025855
dispersion: -0.027106470 hartree
s2: 2.025777
dispersion: -0.027078569 hartree
s2: 2.025941
dispersion: -0.027038920 hartree
s2: 2.025907
dispersion: -0.027021978 hartree
s2: 2.025798
dispersion: -0.027037179 hartree
s2: 2.025837
dispersion: -0.027082693 hartree
s2: 2.025853
dispersion: -0.027128997 hartree
s2: 2.025864
dispersion: -0.027144828 hartree
s2: 2.025851
dispersion: -0.027100171 hartree
s2: 2.025825
dispersion: -0.027059205 hartree
s2: 2.025810
dispersion: -0.027070568 hartree
s2: 2.025871
dispersion: -0.027093938 hartree
s2: 2.025814
dispersion: -0.027089937 hartree
s2: 2.025841
dispersion: -0.027081601 hartree
s2: 2.025844
dispersion: -0.027086681 hartree
s2: 2.025876
dispersion: -0.027108334 hartree
s2: 2.025888
dispersion: -0.027124091 hartree
s2: 2.025919
dispersion: -0.027156059 hartree
s2: 2.025931
dispersion: -0.027164165 hartree
s2: 2.025971
dispersion: -0.027194193 hartree
s2: 2.026014
dispersion: -0.027213952 hartree
s2: 2.026053
dispersion: -0.027227267 hartree
s2: 2.026075
dispersion: -0.027245906 hartree
s2: 2.026093
dispersion: -0.027229123 hartree
s2: 2.026107
dispersion: -0.027233070 hartree
s2: 2.026119
dispersion: -0.027232733 hartree
s2: 2.026127
dispersion: -0.027196600 hartree
s2: 2.026126
dispersion: -0.027186833 hartree
s2: 2.026097
dispersion: -0.027215190 hartree
s2: 2.026111
dispersion: -0.027221197 hartree
s2: 2.026108
dispersion: -0.027222377 hartree
s2: 2.026099
dispersion: -0.027206738 hartree
s2: 2.026101
dispersion: -0.027214979 hartree
s2: 2.026104
dispersion: -0.027215995 hartree
s2: 2.026103
dispersion: -0.027214753 hartree
dispersion: -0.027210641 hartree
dispersion: -0.027207989 hartree
s2: 2.026100
dispersion: -0.027207975 hartree
dispersion: -0.027208178 hartree
chargesum: 1.0000000
charge: 0.183500 -0.120267 -0.001927 0.194680 0.005925 0.195508 -0.120368 0.183375 0.015148 0.191120 0.025455 0.192212 -0.018170 0.031887 -0.448751 0.245974 0.244699
charge: 0.044020 0.023031 0.138486 0.048350 0.148192 0.048654 0.022400 0.043961 0.146380 0.039918 0.155977 0.039851 0.149832 -0.110500 0.293523 -0.115093 -0.116980
qa: 0.1835 -0.1203 -0.0019 0.1947 0.0059 0.1955 -0.1204 0.1834 0.0151 0.1911 0.0255 0.1922 -0.0182 0.0319 -0.4488 0.2460 0.2447
va: 0.9901 4.0179 3.9192 0.9796 3.9088 0.9789 4.0187 0.9902 3.8129 1.0335 3.7995 1.0333 2.3344 2.6907 2.0521 1.0095 1.0106
dispersion: -0.027209106 hartree
energy: -438.576458529648 hartree
dipole: 3.51229 -3.56665 -0.05435 -5.04803 3.64088 -1.40716 -1.95244 1.70342 -0.24901
magnitude: 1.43005 au
magnitude: 3.63490 debye
zeropoint: 0.12740787 hartree
thermalvibcorrection: 0.00952173 hartree
thermalrotcorrection: 0.00141627 hartree
thermaltrasncorrection: 0.00141627 hartree
thermaltotal: -438.43669639 hartree
thermalcorr: 0.01235427 hartree
nonthermalcorr: 0.12740787 hartree
totalcorr: 0.13976213 hartree
totalenthalpy: -438.43575219 hartree
vibrat: 0.01853434 hartree
rotat: 0.01430967 hartree
total: 0.05308137 hartree
