program: Orca
programVersion: 5.0.4
elementType: C C C C C C C H H H H H H H H
charge: 0
multiplicity: 1
keywords: wB97X-D3BJ Opt Freq def2-TZVPP def2/J RIJCOSX VeryTightSCF
keywords: PAL8 VeryTightOpt defgrid3
frequency: 0.00 0.00 0.00 0.00 0.00 0.00 23.91 211.53 345.28 418.84 479.89 532.66 639.87 721.78 757.00 813.37 879.41 936.69 1009.37 1013.55 1027.02 1033.31 1069.43 1074.54 1122.16 1178.90 1211.53 1253.96 1313.54 1366.58 1425.59 1484.72 1497.80 1518.56 1556.29 1672.45 1695.86 3060.75 3124.06 3145.25 3183.45 3185.22 3198.20 3207.04 3219.96
frequency: 23.91 211.53 345.28 418.84 479.89 532.66 639.87 721.78 757.00 813.37 879.41 936.69 1009.37 1013.55 1027.02 1033.31 1069.43 1074.54 1122.16 1178.90 1211.53 1253.96 1313.54 1366.58 1425.59 1484.72 1497.80 1518.56 1556.29 1672.45 1695.86 3060.75 3124.06 3145.25 3183.45 3185.22 3198.20 3207.04 3219.96
formula: C7H8
InChI: InChI=1/C7H8/c1-7-5-3-2-4-6-7/h2-6H,1H3
15 atoms
C  1.179381 -0.187793 0.065263
C  0.961917 -1.559338 0.053764
C  -0.332571 -2.060319 -0.0079
C  -1.404322 -1.178279 -0.05572
C  -1.180815 0.192904 -0.043709
C  0.112473 0.707374 0.013997
C  0.354988 2.195344 -0.004111
H  2.193443 0.195493 0.117483
H  1.805691 -2.238888 0.096414
H  -0.504629 -3.130362 -0.014454
H  -2.418917 -1.558078 -0.099415
H  -2.023892 0.875466 -0.077396
H  0.518167 2.548023 -1.026226
H  1.238154 2.458534 0.580502
H  -0.499068 2.739922 0.40151
totalener: -271.77323930 hartree
nucrepener: 269.87914463 hartree
electener: -541.65238393 hartree
oneelecener: -898.82217445 hartree
twoeener: 357.16979052 hartree
kineticenergy: 270.49540895 hartree
exchangeener: -26.100285870398 hartree
correlationener: -2.028879353414 hartree
xcener: -28.129165223812 hartree
dispersion: -0.027880042 hartree
temp: 298.15 k
press: 1.00 atm
thermalcorrenthalpy: 0.00094421 hartree
totalenthalpy: -271.66501867 hartree
vibrat: 0.00559544 hartree
rotat: 0.01281000 hartree
transl: 0.01875532 hartree
total: 0.03716076 hartree
totalentropycorr: -0.03716076 hartree
gibbsenthalpy: -271.70217943 hartree
gibbsminuselec: 0.09893991 hartree
dispersion: -0.027880142 hartree
dispersion: -0.027880133 hartree
dispersion: -0.027880124 hartree
chargesum: -0.0000000
charge: -0.155275 -0.109033 -0.139976 -0.108951 -0.153218 0.057981 -0.230420 0.105735 0.119036 0.118194 0.119104 0.105138 0.099715 0.087105 0.084867
charge: -0.009767 -0.015807 -0.022628 -0.015779 -0.010315 -0.082546 0.020997 0.017896 0.016694 0.015006 0.016680 0.017493 0.018867 0.016765 0.016444
qa: -0.1553 -0.1090 -0.1400 -0.1090 -0.1532 0.0580 -0.2304 0.1057 0.1190 0.1182 0.1191 0.1051 0.0997 0.0871 0.0849
va: 3.9970 3.9861 4.0088 3.9870 3.9968 3.7426 3.9120 1.0054 0.9993 1.0008 0.9993 1.0058 0.9924 1.0027 1.0041
energy: -271.801118965977 hartree
dipole: 0.56675 -0.54007 0.02668 3.46728 -3.32273 0.14455 -0.03959 0.02621 -0.01338
magnitude: 0.14760 au
magnitude: 0.37517 debye
quadrupole: 199.51520 -228.36577 -28.85057 418.21530 -446.82863 -28.61333 5.94557 -40.17871 -34.23314 36.33921 -36.29105 0.04817 8.54825 -8.30654 0.24171 -0.92398 0.87469 -0.04929
zeropoint: 0.12896552 hartree
thermalvibcorrection: 0.00335885 hartree
thermalrotcorrection: 0.00141627 hartree
thermaltrasncorrection: 0.00141627 hartree
thermaltotal: -271.66596206 hartree
thermalcorr: 0.00619139 hartree
nonthermalcorr: 0.12896552 hartree
totalcorr: 0.13515691 hartree
totalenthalpy: -271.66501785 hartree
vibrat: 0.00563481 hartree
rotat: 0.01280999 hartree
total: 0.03720012 hartree
