program: Orca
programVersion: 5.0.4
elementType: C C C C C C C H H H H H H H H H
charge: 1
multiplicity: 1
keywords: wB97X-D3BJ Opt Freq def2-TZVPP def2/J RIJCOSX VeryTightSCF
keywords: PAL8 VeryTightOpt defgrid3
frequency: 0.00 0.00 0.00 0.00 0.00 0.00 48.52 142.72 275.28 339.57 361.52 508.11 534.55 599.52 732.26 796.59 815.09 892.05 918.58 990.87 1010.94 1034.97 1046.48 1051.28 1079.82 1179.40 1183.14 1221.18 1268.99 1321.50 1354.18 1401.96 1420.21 1458.77 1497.82 1510.27 1518.27 1584.93 1693.56 3018.00 3035.22 3047.73 3133.98 3184.51 3213.93 3214.44 3230.71 3232.40
frequency: 48.52 142.72 275.28 339.57 361.52 508.11 534.55 599.52 732.26 796.59 815.09 892.05 918.58 990.87 1010.94 1034.97 1046.48 1051.28 1079.82 1179.40 1183.14 1221.18 1268.99 1321.50 1354.18 1401.96 1420.21 1458.77 1497.82 1510.27 1518.27 1584.93 1693.56 3018.00 3035.22 3047.73 3133.98 3184.51 3213.93 3214.44 3230.71 3232.40
formula: C7H9
InChI: InChI=1/C7H9/c1-7-5-3-2-4-6-7/h3-6H,2H2,1H3
16 atoms
C  1.161353 -0.231938 0.009671
C  0.912473 -1.562938 -0.031828
C  -0.458307 -2.087939 -0.067902
C  -1.530564 -1.08496 -0.054571
C  -1.260219 0.241851 -0.012551
C  0.084995 0.693318 0.021104
C  0.369814 2.14883 0.036642
H  2.176586 0.143654 0.039325
H  1.729452 -2.276523 -0.038223
H  0.450943 2.478015 -1.007829
H  1.319361 2.372204 0.521558
H  -0.438718 2.717245 0.494525
H  -2.059394 0.97246 0.000355
H  -0.60541 -2.79983 0.760761
H  -2.555998 -1.43797 -0.078387
H  -0.577788 -2.740624 -0.948758
totalener: -272.07728714 hartree
nucrepener: 279.27163558 hartree
electener: -551.34892272 hartree
oneelecener: -907.61642762 hartree
twoeener: 356.26750489 hartree
kineticenergy: 270.79202538 hartree
exchangeener: -26.147862114420 hartree
correlationener: -2.028803010966 hartree
xcener: -28.176665125386 hartree
dispersion: -0.028533843 hartree
temp: 298.15 k
press: 1.00 atm
thermalcorrenthalpy: 0.00094421 hartree
totalenthalpy: -271.95971258 hartree
vibrat: 0.00563343 hartree
rotat: 0.01285468 hartree
transl: 0.01877073 hartree
total: 0.03725884 hartree
totalentropycorr: -0.03725884 hartree
gibbsenthalpy: -271.99697142 hartree
gibbsminuselec: 0.10884957 hartree
dispersion: -0.028583487 hartree
dispersion: -0.028563150 hartree
dispersion: -0.028553692 hartree
dispersion: -0.028550412 hartree
dispersion: -0.028551972 hartree
dispersion: -0.028552600 hartree
chargesum: 1.0000000
charge: -0.121743 -0.037517 -0.028676 -0.037359 -0.121943 0.141986 -0.198654 0.167079 0.183651 0.149955 0.126491 0.126144 0.166921 0.150601 0.183712 0.149353
charge: 0.031129 0.141545 0.010757 0.141673 0.031092 0.071351 0.071746 0.044022 0.048268 0.060250 0.040104 0.039858 0.043989 0.087487 0.048282 0.088446
qa: -0.1217 -0.0375 -0.0287 -0.0374 -0.1219 0.1420 -0.1987 0.1671 0.1837 0.1500 0.1265 0.1261 0.1669 0.1506 0.1837 0.1494
va: 3.9145 3.9036 4.0180 3.9037 3.9149 3.7247 3.9070 0.9979 0.9833 0.9921 1.0008 1.0011 0.9980 0.9994 0.9832 0.9991
dispersion: -0.028552636 hartree
energy: -272.116951290198 hartree
dipole: 0.30937 -0.39928 -0.08991 1.56712 -2.03205 -0.46493 -0.10909 0.04364 -0.06545
magnitude: 0.47804 au
magnitude: 1.21509 debye
zeropoint: 0.13920472 hartree
thermalvibcorrection: 0.00392294 hartree
thermalrotcorrection: 0.00141627 hartree
thermaltrasncorrection: 0.00141627 hartree
thermaltotal: -271.97099109 hartree
thermalcorr: 0.00675549 hartree
nonthermalcorr: 0.13920472 hartree
totalcorr: 0.14596020 hartree
totalenthalpy: -271.97004688 hartree
vibrat: 0.00649485 hartree
rotat: 0.01286285 hartree
total: 0.03812843 hartree
