program: Orca
programVersion: 5.0.4
elementType: H C C H C H C C C H C H O H H O H H H H H H
charge: 1
multiplicity: 1
keywords: wB97X-D3BJ Opt Freq def2-TZVPP def2/J RIJCOSX VeryTightSCF
keywords: PAL8 VeryTightOpt defgrid3
frequency: 0.00 0.00 0.00 0.00 0.00 0.00 8.16 41.05 66.31 71.83 88.31 145.15 182.86 235.00 272.10 321.75 344.48 422.11 427.65 443.38 488.01 527.49 530.63 637.06 729.40 776.68 808.81 815.11 913.95 962.05 1012.30 1028.98 1039.13 1054.85 1067.32 1076.09 1120.63 1185.70 1213.99 1252.98 1272.76 1310.88 1368.69 1433.59 1480.19 1496.63 1514.51 1550.78 1596.68 1629.02 1659.97 1682.20 1714.74 2073.77 3072.82 3140.78 3159.49 3187.28 3195.45 3202.64 3206.51 3213.77 3228.95 3813.17 3825.79 3913.83
frequency: 8.16 41.05 66.31 71.83 88.31 145.15 182.86 235.00 272.10 321.75 344.48 422.11 427.65 443.38 488.01 527.49 530.63 637.06 729.40 776.68 808.81 815.11 913.95 962.05 1012.30 1028.98 1039.13 1054.85 1067.32 1076.09 1120.63 1185.70 1213.99 1252.98 1272.76 1310.88 1368.69 1433.59 1480.19 1496.63 1514.51 1550.78 1596.68 1629.02 1659.97 1682.20 1714.74 2073.77 3072.82 3140.78 3159.49 3187.28 3195.45 3202.64 3206.51 3213.77 3228.95 3813.17 3825.79 3913.83
formula: C7H13O2
InChI: InChI=1/C7H8.H3O.H2O/c1-7-5-3-2-4-6-7;;/h2-6H,1H3;1H3;1H2
22 atoms
H  1.283186 -0.394988 2.320678
C  0.862747 -0.182167 1.345473
C  -0.479382 0.153029 1.21773
H  -1.114472 0.204779 2.094785
C  -1.022861 0.409151 -0.04429
H  -2.07744 0.647377 -0.136758
C  -0.23735 0.317681 -1.199983
C  -0.842425 0.523856 -2.562914
C  1.111216 -0.022532 -1.052206
H  1.728135 -0.126339 -1.939199
C  1.654207 -0.272547 0.203098
H  2.693974 -0.56936 0.292585
O  0.449055 3.002221 0.259678
H  1.478669 2.968007 -0.03151
H  0.352775 3.242252 1.191763
O  2.822723 2.954594 -0.358241
H  3.201556 2.099821 -0.58768
H  3.197692 3.621374 -0.943152
H  -0.005079 2.127248 0.104437
H  -1.68219 1.218574 -2.527955
H  -1.218932 -0.427053 -2.947352
H  -0.107275 0.898644 -3.275709
totalener: -425.08624556 hartree
nucrepener: 464.98991596 hartree
electener: -890.07616152 hartree
oneelecener: -1486.24024282 hartree
twoeener: 596.16408130 hartree
kineticenergy: 423.16247725 hartree
exchangeener: -38.407560808315 hartree
correlationener: -2.885728079061 hartree
xcener: -41.293288887376 hartree
dispersion: -0.037377199 hartree
temp: 298.15 k
press: 1.00 atm
thermalcorrenthalpy: 0.00094421 hartree
totalenthalpy: -424.92102242 hartree
vibrat: 0.01682765 hartree
rotat: 0.01401582 hartree
transl: 0.01923385 hartree
total: 0.05007732 hartree
totalentropycorr: -0.05007732 hartree
gibbsenthalpy: -424.97109974 hartree
gibbsminuselec: 0.15252302 hartree
dispersion: -0.037272914 hartree
dispersion: -0.037250798 hartree
dispersion: -0.037225622 hartree
dispersion: -0.037222537 hartree
dispersion: -0.037220690 hartree
dispersion: -0.037217615 hartree
dispersion: -0.037216608 hartree
dispersion: -0.037218601 hartree
chargesum: 1.0000000
charge: 0.166063 -0.111399 -0.218219 0.166927 -0.111327 0.169920 -0.012763 -0.223453 -0.221423 0.157505 -0.164488 0.175542 -0.173447 0.293429 0.283917 -0.325340 0.271440 0.271308 0.275011 0.100950 0.134492 0.095355
charge: 0.029788 -0.012831 -0.009539 0.031038 -0.011901 0.031483 -0.087725 0.036791 -0.015825 0.028041 -0.013858 0.028198 0.719703 -0.149866 -0.020244 0.522062 -0.076932 -0.069361 -0.042149 0.024633 0.035957 0.022534
qa: 0.1661 -0.1114 -0.2182 0.1669 -0.1113 0.1699 -0.0128 -0.2235 -0.2214 0.1575 -0.1645 0.1755 -0.1734 0.2934 0.2839 -0.3253 0.2714 0.2713 0.2750 0.1009 0.1345 0.0954
va: 0.9944 3.9373 3.9495 0.9972 3.8028 0.9928 3.6854 3.9207 3.8577 1.0004 3.9005 0.9880 2.4272 1.0542 0.9777 2.2496 0.9942 0.9891 1.0603 1.0010 0.9922 1.0007
dispersion: -0.037219550 hartree
energy: -425.124730228452 hartree
dipole: 0.42024 0.78365 1.20389 3.08691 -1.01830 2.06862 -2.85406 3.05939 0.20533
magnitude: 2.40222 au
magnitude: 6.10597 debye
zeropoint: 0.18967150 hartree
thermalvibcorrection: 0.00947201 hartree
thermalrotcorrection: 0.00141627 hartree
thermaltrasncorrection: 0.00141627 hartree
thermaltotal: -424.92275418 hartree
thermalcorr: 0.01230455 hartree
nonthermalcorr: 0.18967150 hartree
totalcorr: 0.20197605 hartree
totalenthalpy: -424.92180997 hartree
vibrat: 0.01752133 hartree
rotat: 0.01402662 hartree
total: 0.05078179 hartree
