program: Orca
programVersion: 5.0.4
elementType: H C C H C C C H C H C H H H H O N
charge: 1
multiplicity: 3
keywords: UKS wB97X-D3BJ Opt Freq def2-TZVPP def2/J RIJCOSX VeryTightSCF
keywords: PAL8 VeryTightOpt defgrid3
frequency: 0.00 0.00 0.00 0.00 0.00 0.00 32.79 35.59 55.10 68.10 76.16 81.77 150.06 347.21 355.33 390.14 506.49 515.45 580.67 750.62 792.26 821.53 956.48 996.06 1002.99 1011.40 1023.24 1048.47 1057.03 1102.93 1175.55 1223.93 1275.01 1323.03 1377.55 1401.55 1417.79 1446.81 1484.91 1498.26 1566.66 1723.90 2058.44 3009.73 3120.01 3178.62 3218.22 3223.45 3226.17 3239.48 3243.04
frequency: 32.79 35.59 55.10 68.10 76.16 81.77 150.06 347.21 355.33 390.14 506.49 515.45 580.67 750.62 792.26 821.53 956.48 996.06 1002.99 1011.40 1023.24 1048.47 1057.03 1102.93 1175.55 1223.93 1275.01 1323.03 1377.55 1401.55 1417.79 1446.81 1484.91 1498.26 1566.66 1723.90 2058.44 3009.73 3120.01 3178.62 3218.22 3223.45 3226.17 3239.48 3243.04
formula: C7H8NO
InChI: InChI=1/C7H8.NO/c1-7-5-3-2-4-6-7;1-2/h2-6H,1H3;
17 atoms
H  1.363085 1.140163 2.17782
C  0.94915 0.735566 1.262978
C  -0.183464 -0.018644 1.278465
H  -0.699891 -0.234185 2.206096
C  -0.718594 -0.544964 0.056365
C  -1.920392 -1.397535 0.078301
C  -0.048122 -0.269081 -1.180438
H  -0.462699 -0.672073 -2.096572
C  1.084496 0.485221 -1.193147
H  1.600359 0.702199 -2.119866
C  1.596537 0.994459 0.027913
H  2.50077 1.592751 0.016714
H  -2.46439 -1.371569 -0.86552
H  -2.577551 -1.162798 0.915703
H  -1.573998 -2.433477 0.223568
O  2.080418 -3.805901 0.527631
N  1.414386 -2.88995 0.40826
totalener: -401.42392701 hartree
nucrepener: 391.35409383 hartree
electener: -792.77802085 hartree
oneelecener: -1305.78706179 hartree
twoeener: 513.00904094 hartree
kineticenergy: 399.78420262 hartree
exchangeener: -36.282286872990 hartree
correlationener: -2.634075596563 hartree
xcener: -38.916362469553 hartree
s2: 2.024981
dispersion: -0.030859583 hartree
temp: 298.15 k
press: 1.00 atm
thermalcorrenthalpy: 0.00094421 hartree
totalenthalpy: -401.31062864 hartree
vibrat: 0.01463022 hartree
rotat: 0.01399873 hartree
transl: 0.01915457 hartree
total: 0.04882081 hartree
totalentropycorr: -0.04882081 hartree
gibbsenthalpy: -401.35944945 hartree
gibbsminuselec: 0.09533714 hartree
dispersion: -0.030859772 hartree
chargesum: 1.0000000
charge: 0.186880 -0.080175 -0.071318 0.174073 0.133931 -0.194476 -0.072840 0.173897 -0.079246 0.186965 0.016527 0.196748 0.129003 0.130071 0.154537 -0.013259 0.028682
charge: 0.046312 0.056594 0.076944 0.046805 0.069527 0.068528 0.075972 0.046676 0.057377 0.046348 0.171834 0.048931 0.042107 0.042906 0.064236 0.153220 -0.114315
qa: 0.1869 -0.0802 -0.0713 0.1741 0.1339 -0.1945 -0.0728 0.1739 -0.0792 0.1870 0.0165 0.1967 0.1290 0.1301 0.1545 -0.0133 0.0287
va: 0.9863 4.0009 3.9441 0.9912 3.7090 3.8953 3.9459 0.9914 4.0003 0.9862 3.8986 0.9782 1.0008 1.0003 0.9983 2.3405 2.6959
dispersion: -0.030860143 hartree
energy: -401.454786648132 hartree
dipole: -5.82242 5.26129 -0.56112 4.04776 -2.76345 1.28431 -0.70572 0.55038 -0.15533
magnitude: 1.41012 au
magnitude: 3.58424 debye
zeropoint: 0.13256650 hartree
thermalvibcorrection: 0.00781477 hartree
thermalrotcorrection: 0.00141627 hartree
thermaltrasncorrection: 0.00141627 hartree
thermaltotal: -401.31157283 hartree
thermalcorr: 0.01064732 hartree
nonthermalcorr: 0.13256650 hartree
totalcorr: 0.14321382 hartree
totalenthalpy: -401.31062862 hartree
vibrat: 0.01462948 hartree
rotat: 0.01399859 hartree
total: 0.04881993 hartree
