program: Orca
programVersion: 5.0.4
elementType: C C C C C C C H H C H H H H H H H H H
charge: 1
multiplicity: 1
keywords: wB97X-D3BJ Opt Freq def2-TZVPP def2/J RIJCOSX VeryTightSCF
keywords: PAL8 VeryTightOpt defgrid3
frequency: 0.00 0.00 0.00 0.00 0.00 0.00 73.22 106.75 111.24 200.42 285.87 292.18 380.58 430.95 448.75 465.61 631.09 730.92 751.70 809.47 892.28 912.69 962.62 1010.94 1037.68 1048.00 1075.40 1084.99 1100.95 1181.12 1207.63 1213.93 1250.12 1314.41 1345.60 1395.95 1414.82 1440.87 1443.50 1474.52 1490.40 1491.03 1500.08 1522.82 1610.81 1701.56 3011.16 3046.90 3059.98 3077.18 3133.33 3146.08 3172.12 3179.60 3190.19 3209.92 3227.54
frequency: 73.22 106.75 111.24 200.42 285.87 292.18 380.58 430.95 448.75 465.61 631.09 730.92 751.70 809.47 892.28 912.69 962.62 1010.94 1037.68 1048.00 1075.40 1084.99 1100.95 1181.12 1207.63 1213.93 1250.12 1314.41 1345.60 1395.95 1414.82 1440.87 1443.50 1474.52 1490.40 1491.03 1500.08 1522.82 1610.81 1701.56 3011.16 3046.90 3059.98 3077.18 3133.33 3146.08 3172.12 3179.60 3190.19 3209.92 3227.54
formula: C8H11
InChI: InChI=1/C8H11/c1-7-3-5-8(2)6-4-7/h3-5H,6H2,1-2H3
19 atoms
C  1.316216 -0.125304 0.047318
C  1.022245 -1.566315 0.031826
C  -0.246796 -2.04805 -0.00336
C  -1.289097 -1.082373 -0.029046
C  -1.094111 0.297086 -0.032566
C  0.181519 0.810174 -0.01429
C  0.453879 2.270905 -0.076721
H  1.887122 0.1013 0.964668
H  1.8680 -2.245374 0.064081
C  -0.581081 -3.513812 -0.010914
H  -2.312497 -1.449009 -0.049122
H  -1.951005 0.958759 -0.057953
H  0.674589 2.538237 -1.116472
H  1.327081 2.54462 0.51686
H  -0.408088 2.854859 0.241631
H  0.321711 -4.122438 0.006795
H  -1.15206 -3.772589 -0.904622
H  -1.187674 -3.773964 0.85862
H  2.046822 0.124124 -0.737154
totalener: -311.43020648 hartree
nucrepener: 351.78071046 hartree
electener: -663.21091694 hartree
oneelecener: -1103.52669572 hartree
twoeener: 440.31577878 hartree
kineticenergy: 309.93268523 hartree
exchangeener: -30.022582230535 hartree
correlationener: -2.348685747687 hartree
xcener: -32.371267978222 hartree
dispersion: -0.034107940 hartree
temp: 298.15 k
press: 1.00 atm
thermalcorrenthalpy: 0.00094421 hartree
totalenthalpy: -311.28880988 hartree
vibrat: 0.00813470 hartree
rotat: 0.01332857 hartree
transl: 0.01896939 hartree
total: 0.04043266 hartree
totalentropycorr: -0.04043266 hartree
gibbsenthalpy: -311.32924254 hartree
gibbsminuselec: 0.13507188 hartree
dispersion: -0.034050526 hartree
dispersion: -0.034009308 hartree
dispersion: -0.033996144 hartree
dispersion: -0.033991798 hartree
dispersion: -0.033991446 hartree
dispersion: -0.033992349 hartree
dispersion: -0.033992772 hartree
dispersion: -0.033992782 hartree
chargesum: 1.0000000
charge: -0.030254 -0.041939 -0.038167 0.030144 -0.099713 0.050033 -0.206343 0.152597 0.167298 -0.222946 0.180105 0.166483 0.139910 0.121600 0.125665 0.105605 0.123619 0.123836 0.152467
charge: 0.020188 0.133671 -0.072870 0.172114 0.027040 0.057040 0.062505 0.092845 0.044458 0.049612 0.057794 0.042820 0.051442 0.038729 0.038303 0.030719 0.033511 0.033524 0.086554
qa: -0.0303 -0.0419 -0.0382 0.0301 -0.0997 0.0500 -0.2063 0.1526 0.1673 -0.2229 0.1801 0.1665 0.1399 0.1216 0.1257 0.1056 0.1236 0.1238 0.1525
va: 3.9892 3.8828 3.8290 3.8674 3.9047 3.7878 3.9212 0.9988 0.9910 3.9171 0.9820 0.9975 0.9926 1.0006 1.0017 1.0046 0.9946 0.9946 1.0011
dispersion: -0.033992690 hartree
energy: -311.475203651786 hartree
dipole: 1.21137 -0.90745 0.30392 0.48393 -0.09035 0.39358 -0.07739 0.07301 -0.00438
magnitude: 0.49728 au
magnitude: 1.26399 debye
zeropoint: 0.16698392 hartree
thermalvibcorrection: 0.00565652 hartree
thermalrotcorrection: 0.00141627 hartree
thermaltrasncorrection: 0.00141627 hartree
thermaltotal: -311.29973067 hartree
thermalcorr: 0.00848906 hartree
nonthermalcorr: 0.16698392 hartree
totalcorr: 0.17547298 hartree
totalenthalpy: -311.29878646 hartree
vibrat: 0.00967083 hartree
rotat: 0.01333801 hartree
total: 0.04197823 hartree
