program: Orca
programVersion: 5.0.4
elementType: H C C C C H C H C C C H O H H H H H H H H H
charge: 1
multiplicity: 1
keywords: wB97X-D3BJ Opt Freq def2-TZVPP def2/J RIJCOSX VeryTightSCF
keywords: PAL8 VeryTightOpt defgrid3
frequency: 0.00 0.00 0.00 0.00 0.00 0.00 33.69 53.26 72.90 105.26 129.55 143.66 148.94 237.18 281.00 287.95 299.65 315.19 383.98 443.14 452.02 484.25 634.19 733.30 751.96 817.65 888.09 916.56 963.08 1016.17 1040.63 1052.32 1074.76 1090.10 1099.68 1178.63 1209.73 1218.96 1251.38 1314.76 1343.73 1397.33 1414.39 1440.75 1446.19 1480.06 1491.84 1493.24 1504.67 1523.13 1611.43 1651.93 1700.17 2841.30 3064.50 3076.48 3081.82 3129.26 3144.84 3169.88 3179.44 3189.66 3209.23 3227.38 3849.41 3938.93
frequency: 33.69 53.26 72.90 105.26 129.55 143.66 148.94 237.18 281.00 287.95 299.65 315.19 383.98 443.14 452.02 484.25 634.19 733.30 751.96 817.65 888.09 916.56 963.08 1016.17 1040.63 1052.32 1074.76 1090.10 1099.68 1178.63 1209.73 1218.96 1251.38 1314.76 1343.73 1397.33 1414.39 1440.75 1446.19 1480.06 1491.84 1493.24 1504.67 1523.13 1611.43 1651.93 1700.17 2841.30 3064.50 3076.48 3081.82 3129.26 3144.84 3169.88 3179.44 3189.66 3209.23 3227.38 3849.41 3938.93
formula: C8H13O
InChI: InChI=1/C8H11.H2O/c1-7-3-5-8(2)6-4-7;/h3-5H,6H2,1-2H3;1H2
22 atoms
H  0.065002 2.410825 -1.178376
C  -0.147271 1.509624 -0.616844
C  0.842491 0.901028 0.123058
C  2.230001 1.429807 0.196236
C  0.522599 -0.341629 0.829534
H  0.952963 -0.366246 1.837892
C  -0.863509 -0.812481 0.804116
H  -1.096262 -1.709472 1.368594
C  -1.828777 -0.188365 0.077363
C  -3.252911 -0.666211 0.003812
C  -1.432555 0.975862 -0.630447
H  -2.188827 1.488106 -1.219994
O  2.761687 -1.962883 -0.607143
H  2.810034 -2.257234 -1.520449
H  3.415248 -2.490094 -0.139938
H  1.143239 -1.115911 0.315161
H  2.46329 1.711713 1.227133
H  2.368294 2.297426 -0.445692
H  2.935408 0.644547 -0.08856
H  -3.937037 0.105545 0.36156
H  -3.398765 -1.559581 0.609372
H  -3.527371 -0.902131 -1.026155
totalener: -387.93325742 hartree
nucrepener: 433.45563100 hartree
electener: -821.38888842 hartree
oneelecener: -1371.00235670 hartree
twoeener: 549.61346828 hartree
kineticenergy: 386.16973040 hartree
exchangeener: -36.155392345256 hartree
correlationener: -2.770885717430 hartree
xcener: -38.926278062686 hartree
dispersion: -0.036391619 hartree
temp: 298.15 k
press: 1.00 atm
thermalcorrenthalpy: 0.00094421 hartree
totalenthalpy: -387.76690397 hartree
vibrat: 0.01569558 hartree
rotat: 0.01410818 hartree
transl: 0.01918944 hartree
total: 0.04899319 hartree
totalentropycorr: -0.04899319 hartree
gibbsenthalpy: -387.81589716 hartree
gibbsminuselec: 0.15375188 hartree
dispersion: -0.036392403 hartree
dispersion: -0.036436238 hartree
dispersion: -0.036430006 hartree
dispersion: -0.036428972 hartree
dispersion: -0.036434746 hartree
dispersion: -0.036419392 hartree
dispersion: -0.036432787 hartree
dispersion: -0.036434353 hartree
chargesum: 1.0000000
charge: 0.159962 -0.123675 0.074022 -0.201627 -0.047551 0.140294 -0.021712 0.158794 -0.057171 -0.228095 0.036271 0.176034 -0.431245 0.243527 0.246545 0.166274 0.125570 0.114421 0.123630 0.121776 0.103116 0.120840
charge: 0.039753 0.023042 0.055810 0.059438 0.017784 0.075890 0.129246 0.042703 -0.075329 0.046352 0.158598 0.054940 0.307398 -0.113874 -0.113234 0.083329 0.043087 0.032612 0.039465 0.032101 0.029265 0.031627
qa: 0.1600 -0.1237 0.0740 -0.2016 -0.0476 0.1403 -0.0217 0.1588 -0.0572 -0.2281 0.0363 0.1760 -0.4312 0.2435 0.2465 0.1663 0.1256 0.1144 0.1236 0.1218 0.1031 0.1208
va: 1.0006 3.9240 3.7857 3.8963 3.8827 1.0084 3.8744 0.9925 3.8372 3.9215 3.8552 0.9828 2.0735 1.0105 1.0086 1.0711 0.9975 1.0058 1.0249 0.9946 1.0049 0.9945
dispersion: -0.036436557 hartree
energy: -387.970260482807 hartree
dipole: 2.01933 -1.53564 0.48369 -1.71861 1.39614 -0.32247 0.10113 -0.18521 -0.08408
magnitude: 0.58738 au
magnitude: 1.49300 debye
zeropoint: 0.19073856 hartree
thermalvibcorrection: 0.00936561 hartree
thermalrotcorrection: 0.00141627 hartree
thermaltrasncorrection: 0.00141627 hartree
thermaltotal: -387.76732378 hartree
thermalcorr: 0.01219815 hartree
nonthermalcorr: 0.19073856 hartree
totalcorr: 0.20293671 hartree
totalenthalpy: -387.76637957 hartree
vibrat: 0.01684227 hartree
rotat: 0.01410973 hartree
total: 0.05014143 hartree
