program: Orca
programVersion: 5.0.4
elementType: H C C H C C C H C H C C H H H H H H O N O H H
charge: 1
multiplicity: 3
keywords: UKS wB97X-D3BJ Opt Freq def2-TZVPP def2/J RIJCOSX VeryTightSCF
keywords: PAL8 VeryTightOpt defgrid3
frequency: 0.00 0.00 0.00 0.00 0.00 0.00 16.18 32.00 45.82 56.24 60.11 63.21 72.53 77.04 97.45 106.58 136.78 156.68 235.33 244.05 293.79 300.66 358.15 386.42 453.41 484.63 574.21 656.85 728.26 808.13 820.19 833.56 982.20 996.12 1015.39 1021.20 1027.86 1039.74 1049.72 1175.39 1217.94 1258.33 1290.30 1313.46 1354.15 1393.31 1395.76 1438.73 1456.77 1463.04 1488.42 1496.46 1512.04 1547.65 1654.27 1733.73 2047.12 3027.23 3032.09 3099.32 3122.17 3177.38 3182.45 3217.30 3222.94 3232.39 3243.84 3850.04 3939.01
frequency: 16.18 32.00 45.82 56.24 60.11 63.21 72.53 77.04 97.45 106.58 136.78 156.68 235.33 244.05 293.79 300.66 358.15 386.42 453.41 484.63 574.21 656.85 728.26 808.13 820.19 833.56 982.20 996.12 1015.39 1021.20 1027.86 1039.74 1049.72 1175.39 1217.94 1258.33 1290.30 1313.46 1354.15 1393.31 1395.76 1438.73 1456.77 1463.04 1488.42 1496.46 1512.04 1547.65 1654.27 1733.73 2047.12 3027.23 3032.09 3099.32 3122.17 3177.38 3182.45 3217.30 3222.94 3232.39 3243.84 3850.04 3939.01
formula: C8H12NO2
InChI: InChI=1/C8H10.NO.H2O/c1-7-3-5-8(2)6-4-7;1-2;/h3-6H,1-2H3;;1H2
23 atoms
H  1.263793 1.078426 2.085097
C  0.816359 0.617312 1.21319
C  -0.403083 0.020563 1.289903
H  -0.94807 -0.006301 2.226108
C  -0.99344 -0.585299 0.135739
C  -2.295658 -1.280206 0.248461
C  -0.289491 -0.549392 -1.099262
H  -0.739231 -1.007012 -1.971928
C  0.932826 0.039598 -1.175889
H  1.487043 0.052382 -2.105218
C  1.525132 0.648396 -0.020795
C  2.858528 1.271213 -0.128635
H  2.898512 1.941568 -0.992504
H  3.579365 0.469215 -0.339712
H  3.150325 1.804687 0.77311
H  -2.799604 -1.369756 -0.71276
H  -2.948309 -0.79818 0.977495
H  -2.101735 -2.296992 0.618472
O  1.89425 -3.81013 0.378048
N  1.077381 -3.046112 0.600148
O  3.59937 -1.685389 -1.367716
H  3.842548 -2.440556 -0.825858
H  4.152529 -1.760643 -2.149634
totalener: -517.27730674 hartree
nucrepener: 581.46095506 hartree
electener: -1098.73826180 hartree
oneelecener: -1841.14329471 hartree
twoeener: 742.40503291 hartree
kineticenergy: 515.14632782 hartree
exchangeener: -46.282962500780 hartree
correlationener: -3.377425815168 hartree
xcener: -49.660388315948 hartree
s2: 2.021291
dispersion: -0.039483895 hartree
temp: 298.15 k
press: 1.00 atm
thermalcorrenthalpy: 0.00094421 hartree
totalenthalpy: -517.11641212 hartree
vibrat: 0.02365108 hartree
rotat: 0.01465039 hartree
transl: 0.01948450 hartree
total: 0.05882325 hartree
totalentropycorr: -0.05882325 hartree
gibbsenthalpy: -517.17523538 hartree
gibbsminuselec: 0.14155526 hartree
s2: 2.021271
dispersion: -0.039492708 hartree
s2: 2.021288
dispersion: -0.039488661 hartree
s2: 2.021310
dispersion: -0.039502550 hartree
s2: 2.021320
dispersion: -0.039515484 hartree
s2: 2.021340
dispersion: -0.039535346 hartree
s2: 2.021347
dispersion: -0.039559055 hartree
s2: 2.021402
dispersion: -0.039572759 hartree
s2: 2.021387
dispersion: -0.039575305 hartree
s2: 2.021388
dispersion: -0.039561429 hartree
s2: 2.021406
dispersion: -0.039559666 hartree
s2: 2.021444
dispersion: -0.039586250 hartree
s2: 2.021376
dispersion: -0.039587465 hartree
s2: 2.021378
dispersion: -0.039569882 hartree
s2: 2.021409
dispersion: -0.039581828 hartree
s2: 2.021426
dispersion: -0.039576549 hartree
s2: 2.021404
dispersion: -0.039590342 hartree
dispersion: -0.039590419 hartree
dispersion: -0.039587931 hartree
s2: 2.021405
dispersion: -0.039595991 hartree
s2: 2.021461
dispersion: -0.039610793 hartree
s2: 2.021403
dispersion: -0.039593383 hartree
dispersion: -0.039585970 hartree
s2: 2.021421
dispersion: -0.039594593 hartree
s2: 2.021418
dispersion: -0.039595544 hartree
s2: 2.021416
dispersion: -0.039596591 hartree
s2: 2.021427
dispersion: -0.039596187 hartree
dispersion: -0.039592864 hartree
s2: 2.021423
dispersion: -0.039593056 hartree
s2: 2.021417
dispersion: -0.039591136 hartree
s2: 2.021413
dispersion: -0.039592952 hartree
s2: 2.021415
dispersion: -0.039595617 hartree
s2: 2.021424
dispersion: -0.039600215 hartree
s2: 2.021422
dispersion: -0.039600662 hartree
dispersion: -0.039602123 hartree
dispersion: -0.039601879 hartree
chargesum: 1.0000000
charge: 0.167004 -0.092714 -0.059441 0.168541 0.103642 -0.205330 -0.098935 0.163965 -0.048849 0.151123 0.129177 -0.202961 0.128416 0.148004 0.113170 0.121730 0.126870 0.144806 -0.048082 0.061203 -0.440997 0.232926 0.236731
charge: 0.042821 0.057117 0.069798 0.044509 0.048448 0.061544 0.046766 0.042813 0.077376 0.044847 0.061438 0.060951 0.047217 0.048629 0.030959 0.036863 0.040319 0.056250 0.132322 -0.094489 0.290298 -0.127999 -0.118797
qa: 0.1670 -0.0927 -0.0594 0.1685 0.1036 -0.2053 -0.0989 0.1640 -0.0488 0.1511 0.1292 -0.2030 0.1284 0.1480 0.1132 0.1217 0.1269 0.1448 -0.0481 0.0612 -0.4410 0.2329 0.2367
va: 0.9945 3.9828 3.9472 0.9917 3.7508 3.9069 3.9492 0.9948 3.9539 1.0127 3.7196 3.8710 0.9982 1.0324 1.0069 1.0024 0.9996 0.9958 2.3069 2.6713 2.0397 1.0221 1.0137
dispersion: -0.039601735 hartree
energy: -517.316897488539 hartree
dipole: 0.01907 -0.25967 -0.24060 5.56105 -4.83807 0.72298 -1.96380 1.82541 -0.13839
magnitude: 0.77442 au
magnitude: 1.96843 debye
zeropoint: 0.18410666 hartree
thermalvibcorrection: 0.01341982 hartree
thermalrotcorrection: 0.00141627 hartree
thermaltrasncorrection: 0.00141627 hartree
thermaltotal: -517.11653846 hartree
thermalcorr: 0.01625237 hartree
nonthermalcorr: 0.18410666 hartree
totalcorr: 0.20035903 hartree
totalenthalpy: -517.11559425 hartree
vibrat: 0.02562620 hartree
rotat: 0.01464509 hartree
total: 0.06079308 hartree
