program: Gaussian 09
title: 000004739
version: EM64L-G09RevD.01
frameworkgroup: C1[X(C11H16N4O4)]
method: RPBEPBE
basis: SDD
operation: Freq
keyword: #p
keyword: freq=noraman
keyword: PBEPBE/SDD
title: #p freq=noraman PBEPBE/SDD
converged: YES YES NO NO
title: Mulliken charges:
elementType: O O O O N N N N C C C C C C C C C C C H H H H H H H H H H H H H H H H
charge: -0.312651 -0.446022 -0.428229 -0.442222 -0.200366 -0.086675 -0.393003 0.038007 -0.121797 -0.515077 -0.120715 -0.069537 -0.341610 0.340434 0.033279 -0.244626 -0.154790 -0.498696 -0.287649 0.285603 0.249778 0.269851 0.228302 0.265393 0.197397 0.214486 0.283422 0.206214 0.349526 0.337982 0.247036 0.213947 0.352083 0.209322 0.341606
chargesum: 0.00000
title: Mulliken charges with hydrogens summed into heavy atoms:
elementType: O O O O N N N N C C C C C C C C C C C
charge: -0.312651 -0.096496 -0.076146 -0.100616 -0.200366 -0.086675 -0.055021 0.038007 0.163806 0.004551 0.107587 0.195856 0.070272 0.340434 0.033279 0.038796 0.051424 -0.037714 -0.078327
polarizability: 1.93072764e+02 8.77087034e+00 1.59384149e+02 -1.12269890e+01 5.19218659e+00 1.14854887e+02
1716.lowfreq: -6.7048 -4.9888 0.0004 0.0005 0.0007 7.7804 17.8931 28.2981 55.9856
frequency: 17.7224 28.2376 55.9783 74.3357 89.7321 91.1939 119.2681 132.2531 171.1971 175.7477 246.2912 256.3631 273.7159 292.3387 318.3813 330.1189 343.2773 345.4108 391.3387 415.0466 439.9815 452.8474 468.4621 500.8286 513.4885 540.2939 564.4575 619.6722 644.7171 668.0998 691.7958 713.6685 739.2095 755.7648 776.7467 796.8389 820.0928 834.7191 851.9835 897.9486 903.3169 921.0009 950.8118 961.0552 975.1143 996.6333 1005.5278 1032.7019 1039.6219 1054.1814 1072.0822 1081.0095 1085.5278 1156.3572 1162.6784 1176.9770 1185.3254 1196.7748 1207.6105 1231.9065 1253.6575 1260.5242 1269.6964 1283.8993 1309.1280 1312.6262 1320.7053 1326.4184 1339.8863 1343.3339 1356.3840 1362.3975 1369.7897 1384.8969 1404.7402 1412.4930 1432.5415 1453.7536 1455.3620 1460.7322 1527.6248 1612.5294 1675.6561 2953.8494 2965.3920 2975.5620 2984.4056 3016.6321 3032.7972 3053.6536 3055.7842 3068.4806 3071.7333 3124.2338 3264.1509 3495.2149 3548.0480 3559.2691 3571.1889
redmass: 5.8883 6.0121 5.2568 4.8502 3.8886 5.3159 4.8731 4.1120 4.2631 5.0577 2.4210 1.6543 2.9680 4.6611 3.1140 2.9745 2.0971 1.9148 4.2618 1.2106 5.7695 2.6815 4.4389 4.1871 3.0359 1.2874 3.6340 3.3898 4.5114 5.5216 4.3345 2.6158 2.8641 5.8852 3.2946 4.2866 5.3567 3.5177 3.1173 1.6244 3.9143 3.5199 2.7937 3.5154 2.7134 2.7528 2.8340 2.8274 3.1147 2.6867 3.0099 3.5298 1.9660 1.4700 1.6245 1.6453 1.2671 1.1652 2.5234 1.8024 1.2405 1.1583 1.4748 1.3906 1.9637 1.3883 1.3850 1.4949 1.2878 1.6457 1.4062 1.5884 1.4219 1.3083 1.3685 2.0197 3.2088 1.1068 1.0871 1.0936 2.3237 7.7480 7.1093 1.0680 1.0788 1.0856 1.0708 1.0851 1.0844 1.0956 1.0671 1.0960 1.0889 1.1022 1.0985 1.0771 1.0661 1.0657 1.0665
irintensity: 1.3989 0.5234 2.1641 4.9363 4.3715 1.4695 0.4447 0.8756 1.1224 2.1698 27.1722 110.2583 38.1100 2.3161 6.6438 36.4228 51.7886 94.8329 2.3009 185.4665 28.8923 16.5798 12.4519 4.9941 3.3300 122.0870 16.6139 7.6757 15.1541 17.5595 14.4986 26.3662 0.6411 28.4067 23.7777 24.6360 54.3030 25.0477 12.0521 51.6872 116.3141 2.2126 42.6127 43.4139 42.7384 30.2999 33.5090 38.3056 10.1758 36.8789 5.1887 72.5057 13.3366 24.4746 57.2608 9.0634 39.0618 34.6784 13.0079 136.3783 8.5336 47.4284 5.4701 7.0928 46.2409 12.2346 15.5517 2.9325 4.2211 5.2400 8.6113 1.5823 9.9595 17.8114 43.7146 5.4100 26.6406 7.6418 2.1183 29.9834 280.7957 104.3732 186.8422 38.9338 17.4746 63.1683 80.7227 21.0114 10.8204 35.2336 23.9052 28.0101 36.5982 5.3900 2.3344 55.5081 6.4753 7.8816 8.8339
temp: 298.150 k
press: 1.00000 atm
elementType: 8 8 8 8 7 7 7 7 6 6 6 6 6 6 6 6 6 6 6 1 1 1 1 1 1 1 1 1 1 1 1 1 1 1 1
symmnumber: 1
zpe: 726880.6 jmol-1
zpe.correction: 0.276854 hartree
zpe.thermalcorrener: 0.294794 hartree
zpe.thermalcorrenthalpy: 0.295738 hartree
zpe.thermalcorrgfe: 0.229560 hartree
zpe.sumelectzpe: -947.159270 hartree
zpe.sumelectthermal: -947.141330 hartree
zpe.sumelectthermalent: -947.140386 hartree
zpe.sumelectthermalfe: -947.206565 hartree
dipole: -8.1264 -1.6469 1.5612
dipole: 8.4373
quadrupole: -122.4488 -123.5500 -104.4452
quadrupole: 4.2727 -6.0050 1.2025
quadrupole: -5.6342 -6.7353 12.3695 4.2727 -6.0050 1.2025
hfenergy: -947.4361243 hartree
pointgroup: C01 [X(C11H16N4O4)]
dipole: 3.1300262 0.2061579 1.0860267 debye
polarizability: 190.3927692|0.9726087|156.1133098|20.4727248|11.7676994|120.8057208 unknown
InChI: InChI=1S/C11H16N4O4/c16-3-8-6(17)1-9(19-8)15-5-14-10-7(18)2-12-4-13-11(10)15/h4-9,13,16-18H,1-3H2
charge 0 multiplicity 1
35 atoms
O  1.814896 -1.149407 0.430093
O  2.901309 2.122469 0.151857
O  3.679976 -2.48848 -1.282839
O  -4.330164 0.618868 0.563971
N  0.075077 0.507791 0.791041
N  -1.409195 2.158503 0.312247
N  -1.126512 -1.486025 0.018513
N  -3.314997 -1.768132 -1.111269
C  1.167215 -0.252356 1.414723
C  2.332187 0.600335 1.945096
C  3.248329 0.812998 0.718154
C  2.917585 -0.377396 -0.233517
C  4.071238 -1.364238 -0.436249
C  -1.053303 -0.105565 0.206947
C  -1.964525 0.917131 -0.07327
C  -0.199628 1.894632 0.819765
C  -3.371963 0.799569 -0.564737
C  -3.64081 -0.385493 -1.52039
C  -2.235919 -2.181643 -0.526064
H  0.740345 -0.933173 2.172761
H  2.857929 0.010662 2.713877
H  2.035193 1.56288 2.386668
H  4.318522 0.801623 1.011219
H  2.535483 -0.010125 -1.205675
H  4.435238 -1.712071 0.555086
H  4.904075 -0.875552 -0.9716
H  0.528804 2.629156 1.145825
H  -3.629127 1.737504 -1.101433
H  3.397523 2.275265 -0.691295
H  -0.26556 -2.02355 0.15775
H  -4.722817 -0.373334 -1.739762
H  -3.112628 -0.175596 -2.473428
H  2.882172 -2.913362 -0.875447
H  -2.11466 -3.269614 -0.404297
H  -4.151388 1.341728 1.219479
