program: Gaussian 16
title: coments
version: ES64L-G16RevC.01
frameworkgroup: OH[O(H)]
method: UPBE1PBE
basis: 6-311++G(3d,2p)
operation: SP
keyword: #p
keyword: PBE1PBE/6-311++G(3d,2p)
keyword: scrf=(cpcm,solvent=acetonitrile)
keyword: guess=read
keyword: geom=allcheck
keyword: SCF=(XQC)
keyword: gfprint
keyword: gfinput
title: #p PBE1PBE/6-311++G(3d,2p) scrf=(cpcm,solvent=acetonitrile) guess=read
dipole: 0.0000 0.0000 0.0000
dipole: 0.0000
quadrupole: -1.4188 -1.4188 -1.4188
quadrupole: 0.0000 0.0000 0.0000
quadrupole: 0.0000 0.0000 0.0000 0.0000 0.0000 0.0000
hfenergy: -0.5011731 hartree
pointgroup: OH [O(H1)]
dipole: 0. 0. 0. debye
InChI: InChI=1/H
charge 0 multiplicity 2
1 atoms
H  -0.88137469 0.09977827 0.0000
