program: Gaussian 09
title: 000076193
version: EM64L-G09RevD.01
frameworkgroup: C1[X(C8H6Cl2O2)]
method: RPBEPBE
basis: SDD
operation: Freq
keyword: #p
keyword: freq=noraman
keyword: PBEPBE/SDD
title: #p freq=noraman PBEPBE/SDD
converged: YES YES NO NO
title: Mulliken charges:
elementType: Cl Cl O O C C C C C C C C H H H H H H
charge: -0.001892 0.007399 -0.287924 -0.246123 0.264908 -0.330018 -0.332586 -0.064200 -0.184069 -0.085253 0.188512 -0.498767 0.298736 0.280914 0.263577 0.245971 0.234877 0.245937
chargesum: 0.00000
title: Mulliken charges with hydrogens summed into heavy atoms:
elementType: Cl Cl O O C C C C C C C C
charge: -0.001892 0.007399 -0.287924 -0.246123 0.264908 -0.031282 -0.051672 -0.064200 0.079508 -0.085253 0.188512 0.228017
polarizability: 1.79646923e+02 -8.76874366e-01 1.16286995e+02 -1.87576668e-02 -2.51847535e-05 4.68175225e+01
1716.lowfreq: -7.2065 -0.0039 -0.0036 -0.0033 5.9552 6.0764 43.8104 64.6067 78.1536
frequency: 43.5499 64.5588 78.1396 116.6103 142.0174 182.0375 183.5000 251.0557 283.9364 289.0344 325.2331 422.6485 440.6142 494.0722 517.8421 528.5560 658.2131 683.3406 716.0269 734.2452 798.2330 837.5719 928.5707 932.8759 976.4424 1004.8239 1082.9567 1114.5087 1117.3089 1142.1226 1148.8745 1221.5064 1268.6543 1369.6949 1385.0805 1422.8477 1451.0779 1455.7099 1462.3753 1565.1937 1592.9535 1627.6044 3007.5096 3110.9536 3151.8703 3167.9852 3170.2875 3190.7354
redmass: 2.9809 1.9881 2.5654 5.5535 4.4260 27.7716 5.3512 7.2809 8.4834 6.9649 6.2463 10.4529 3.2156 6.0056 8.3267 5.8103 7.2441 5.7607 6.8761 3.8141 7.0532 1.3990 1.4644 8.4118 1.3573 5.8910 3.4852 1.2631 2.5508 1.3998 1.5061 1.9541 1.9608 5.0101 5.3416 1.2026 1.0497 2.7090 1.0514 8.7951 6.7205 10.2632 1.0294 1.1047 1.1050 1.0897 1.0926 1.0967
irintensity: 0.8372 0.2951 0.5991 0.2892 3.6763 0.0514 2.3969 6.4370 4.2541 4.9608 13.9020 2.3661 7.2806 5.2774 23.2756 0.0200 18.0745 6.3886 5.5687 30.0152 42.8157 25.5479 18.4285 17.7040 0.3577 61.1857 134.1727 0.0185 3.1361 1.2285 63.7328 247.3449 172.7262 26.0152 34.7533 44.5880 15.1563 23.2350 11.6961 27.5626 31.1450 187.9767 36.5150 24.3379 14.5348 0.3088 4.0486 0.9439
temp: 298.150 k
press: 1.00000 atm
elementType: 17 17 8 8 6 6 6 6 6 6 6 6 1 1 1 1 1 1
symmnumber: 1
zpe: 316182.3 jmol-1
zpe.correction: 0.120427 hartree
zpe.thermalcorrener: 0.132150 hartree
zpe.thermalcorrenthalpy: 0.133094 hartree
zpe.thermalcorrgfe: 0.080872 hartree
zpe.sumelectzpe: -1378.150593 hartree
zpe.sumelectthermal: -1378.138870 hartree
zpe.sumelectthermalent: -1378.137926 hartree
zpe.sumelectthermalfe: -1378.190148 hartree
dipole: 2.6553 -2.6680 0.0048
dipole: 3.7642
quadrupole: -74.5963 -82.2432 -83.8784
quadrupole: -5.2896 0.0241 0.0108
quadrupole: 5.6430 -2.0039 -3.6391 -5.2896 0.0241 0.0108
hfenergy: -1378.2710204 hartree
pointgroup: C01 [X(C8H6Cl2O2)]
dipole: 1.0055353 -1.0865489 0.039283 debye
dipolederiv: -0.355692 0.3137484 -0.0121248 0.3626144 -0.4376133 0.013229 -0.0119265 0.0112037 -0.0294307 -0.7868344 -0.1920393 -0.0318914 -0.207779 -0.1089137 -0.0088108 -0.0320944 -0.0081806 -0.0251104 -1.4618257 0.3133979 -0.0479424 0.646325 -0.7132626 0.0261385 -0.0472294 0.0119279 -0.2969569 -0.8356624 -0.2339703 -0.0217259 -0.1178864 -0.8767157 -0.0057969 -0.0217408 -0.0110795 -0.3222372 -0.6626232 -0.0921319 -0.0270385 -0.1343183 -0.0115615 -0.0053465 -0.0271256 -0.0036267 -0.0109869 -0.0125417 0.2501462 0.0028023 -0.0698948 -0.1414391 -0.0030985 0.0018547 0.010012 -0.0596558 0.109994 -0.0533771 0.0088425 0.1729036 0.0046188 0.0076403 0.0093443 -0.0016886 -0.1159971 0.2460443 -0.7312394 0.008911 -0.6909689 0.5553855 -0.0259123 0.0089308 -0.0275692 -0.0423226 -0.382425 -0.0185645 -0.0120739 0.0903779 0.0290917 0.0040337 -0.0116751 -0.0005699 -0.0918378 1.0690099 0.4381872 0.0471101 0.3376614 0.0749647 0.0142514 0.0470287 0.0184753 -0.0406469 2.083529 0.0244467 0.0761103 -0.3510706 1.2594055 -0.0130291 0.0754471 0.0033281 0.2457331 0.7831302 -0.0999698 0.0208586 -0.0303147 0.2252659 -0.00145 0.0214609 -0.0043932 0.2801436 0.1356058 -0.0375565 -0.0012687 0.0004196 0.055229 -0.0004567 -0.0011837 -0.0020015 0.163361 0.0758263 0.0607712 -0.0031963 0.0639114 0.0485339 0.0021319 -0.003094 0.0020995 0.1627114 0.0603801 -0.0372006 -0.0042885 -0.0394875 -0.0174801 -0.0022598 -0.0042542 -0.0021604 0.1632084 -0.0399277 0.016689 0.0087385 -0.0830698 0.060189 0.0959728 0.057638 0.0724344 -0.0483252 0.0081946 0.0557425 -0.0047433 0.12489 -0.0667125 0.0048738 -0.0046106 0.0019526 0.1230981 -0.034182 0.0229203 -0.0070795 -0.0743134 0.0610143 -0.1021109 -0.0567702 -0.0701639 -0.0547481 unknown
polarizability: 179.2815175|-3.1570694|116.43088|5.4062542|0.1182765|47.0390436 unknown
InChI: InChI=1S/C8H6Cl2O2/c1-12-8(11)5-2-3-6(9)7(10)4-5/h2-4H,1H3
charge 0 multiplicity 1
18 atoms
Cl -2.947603 2.113461 -0.102644
Cl -3.944202 -1.019434 -0.155195
O  2.835402 -0.744638 0.124297
O  2.446765 1.553739 0.113511
C  0.563581 0.001663 0.031538
C  -0.388024 1.05086 -0.002819
C  0.131718 -1.348629 0.008908
C  -1.759754 0.749689 -0.059442
C  -1.243658 -1.64476 -0.047603
C  -2.189457 -0.596803 -0.081797
C  2.006208 0.378891 0.092442
C  4.28925 -0.459087 0.187226
H  -0.041459 2.088386 0.015651
H  0.871614 -2.151837 0.035515
H  -1.593736 -2.680493 -0.065427
H  4.601358 0.11999 -0.697754
H  4.768531 -1.447619 0.205404
H  4.524067 0.115723 1.098489
