program: Gaussian 09
title: 000076179
version: EM64L-G09RevD.01
frameworkgroup: C1[X(C8H20O4P2S4)]
method: RPBEPBE
basis: SDD
operation: Freq
keyword: #p
keyword: freq=noraman
keyword: PBEPBE/SDD
title: #p freq=noraman PBEPBE/SDD
converged: NO YES NO NO
title: Mulliken charges:
elementType: S S S S P P O O O O C C C C C C C C H H H H H H H H H H H H H H H H H H H H
charge: -0.065196 -0.028657 -0.211532 -0.212496 0.648765 0.616616 -0.465622 -0.482941 -0.468748 -0.465712 -0.200488 -0.216699 -0.218777 -0.210977 -0.668289 -0.650240 -0.668801 -0.651013 0.235893 0.238729 0.234683 0.226085 0.232812 0.241766 0.229869 0.229490 0.245520 0.233957 0.210394 0.232227 0.235492 0.214178 0.269496 0.215577 0.213886 0.230191 0.239383 0.211179
chargesum: 0.00000
title: Mulliken charges with hydrogens summed into heavy atoms:
elementType: S S S S P P O O O O C C C C C C C C
charge: -0.065196 -0.028657 -0.211532 -0.212496 0.648765 0.616616 -0.465622 -0.482941 -0.468748 -0.465712 0.274134 0.244068 0.255801 0.248382 0.021582 0.031658 0.030158 0.029740
polarizability: 3.26758999e+02 1.67085849e+01 2.30220333e+02 -2.57919177e-01 -6.98227800e+00 1.99942480e+02
1716.lowfreq: -60.5730 -12.7348 -5.3161 -0.0017 -0.0015 -0.0008 6.4905 12.3650 21.7880
frequency: -60.4092 10.5116 21.5879 24.9665 37.6617 38.8119 43.5213 50.7213 56.3065 58.9950 66.2884 78.4416 96.4130 101.8095 105.4104 112.7216 124.1671 138.2590 165.9239 184.3656 205.2725 215.3905 224.4220 238.9033 242.8911 248.4409 255.0993 260.7790 268.5404 283.5510 285.5448 312.4214 323.4064 378.1488 399.0574 412.2390 415.1562 448.5014 534.1388 564.0854 670.7399 679.0060 686.7879 694.1707 809.1628 810.3653 810.5193 819.6684 856.2808 864.5503 867.1135 872.3230 1010.0137 1012.2150 1016.8273 1020.1633 1103.2302 1104.1225 1104.9317 1107.2197 1128.6064 1130.4765 1133.6589 1141.4813 1252.9929 1257.1061 1257.1415 1264.0903 1352.1593 1354.0001 1357.0223 1359.3959 1389.8278 1393.9954 1394.6187 1397.0698 1455.2505 1456.3984 1457.6085 1460.1070 1474.9498 1475.2712 1477.9182 1478.2182 1484.7173 1486.5032 1487.3999 1492.0228 2987.9041 2989.2276 2992.4248 2994.0976 2994.4726 2996.8956 2997.4637 2998.2580 3054.7933 3056.3237 3058.9333 3066.0004 3089.3412 3091.0486 3093.0436 3093.1614 3111.9230 3112.5290 3112.8179 3113.9771
redmass: 1.8859 4.2670 3.5369 3.7312 3.0747 4.7549 3.9161 2.0183 3.9453 4.5980 3.7434 5.4689 3.2824 3.2809 6.1659 6.9929 4.8652 7.2732 9.0656 6.1250 4.2226 2.2850 2.9966 1.5690 1.5476 1.5560 2.3831 1.5065 7.7196 3.6513 3.8836 5.7893 7.3608 7.4218 6.3351 7.6432 10.1152 8.3014 12.4331 10.3301 6.3228 6.2323 8.4291 7.5512 1.0922 1.0891 1.0886 1.0996 4.8208 4.5019 4.3352 3.9604 2.3461 2.3904 2.4805 2.6293 2.2309 2.2533 2.2588 2.2441 1.4013 1.4178 1.4272 1.4210 1.1515 1.1409 1.1381 1.1352 1.2428 1.2485 1.2522 1.2434 1.2412 1.2396 1.2399 1.2346 1.0398 1.0399 1.0401 1.0385 1.0572 1.0565 1.0565 1.0667 1.0736 1.0743 1.0806 1.0599 1.0547 1.0543 1.0509 1.0393 1.0376 1.0382 1.0414 1.0530 1.1082 1.1088 1.1084 1.1079 1.0984 1.0976 1.0980 1.0980 1.1024 1.1024 1.1023 1.1024
irintensity: 1.2720 0.1309 0.2331 0.5541 0.6977 0.9284 3.3024 1.6747 4.8680 0.7884 0.8956 0.3400 1.4137 1.9557 1.6240 1.3885 1.2614 1.0017 7.3420 2.7945 4.8845 4.7000 5.2946 1.1127 2.6270 2.2596 0.4140 1.5738 1.4119 8.0156 17.5021 7.4935 7.5936 84.1522 12.8608 1.1831 6.5285 38.6551 122.3826 81.1429 29.6897 85.6803 82.4758 68.9944 2.8464 5.2798 0.1605 5.2792 192.4462 18.3453 299.5152 120.9050 24.0381 212.1002 107.8120 84.4400 13.6312 14.6303 10.0837 4.6869 5.5733 6.0412 4.6667 4.8190 0.7038 1.0249 0.7232 0.2451 6.1643 7.6879 12.3995 4.5468 15.0308 27.5996 29.3845 39.2132 16.6882 11.1441 14.1565 3.3890 6.9487 2.7915 9.7867 6.7907 9.4142 10.9357 11.3354 7.9978 19.3465 23.8765 20.0200 14.9300 24.9517 30.5747 26.0221 20.4581 9.1872 6.4047 10.7058 8.9515 23.3386 17.6381 29.6755 19.5879 27.1141 52.3905 18.9931 7.6889
temp: 298.150 k
press: 1.00000 atm
elementType: 16 16 16 16 15 15 8 8 8 8 6 6 6 6 6 6 6 6 1 1 1 1 1 1 1 1 1 1 1 1 1 1 1 1 1 1 1 1
symmnumber: 1
zpe: 748903.7 jmol-1
zpe.correction: 0.285242 hartree
zpe.thermalcorrener: 0.312463 hartree
zpe.thermalcorrenthalpy: 0.313407 hartree
zpe.thermalcorrgfe: 0.221702 hartree
zpe.sumelectzpe: -2890.956632 hartree
zpe.sumelectthermal: -2890.929411 hartree
zpe.sumelectthermalent: -2890.928467 hartree
zpe.sumelectthermalfe: -2891.020172 hartree
dipole: 1.6189 4.5803 0.9903
dipole: 4.9579
quadrupole: -143.7118 -150.4937 -155.1487
quadrupole: -8.1749 -11.9271 -0.3433
quadrupole: 6.0729 -0.7090 -5.3640 -8.1749 -11.9271 -0.3433
hfenergy: -2891.2418744 hartree
pointgroup: C01 [X(C8H20O4P2S4)]
dipole: -0.6223223 -1.279934 1.3339076 debye
polarizability: 325.1166138|3.7580163|226.5466634|-22.7688273|-9.6301069|205.2585352 unknown
InChI: InChI=1S/2C4H10O2PS.S2/c2*1-3-5-7(8)6-4-2;1-2/h2*3-4H2,1-2H3;
charge 0 multiplicity 1
38 atoms
S  -1.050245 -0.87437 -1.546307
S  0.554083 0.33931 -2.522342
S  -1.939451 2.670085 -0.405372
S  4.10237 0.968459 -1.981439
P  -2.014843 0.658248 0.001945
P  2.422137 0.097955 -1.152173
O  -1.397257 0.253899 1.55709
O  -3.555272 -0.152405 0.096492
O  1.937619 0.645601 0.422374
O  2.379797 -1.599924 -0.847388
C  -1.210111 -1.184633 1.938783
C  -4.618219 0.20947 -0.889428
C  1.914676 2.123439 0.683592
C  3.504585 -2.191811 -0.048846
C  -0.570808 -1.165515 3.322949
C  -5.843006 -0.617158 -0.51067
C  1.576209 2.286924 2.16096
C  3.253592 -3.695285 -0.034353
H  -2.199699 -1.676393 1.939525
H  -0.553147 -1.662231 1.187609
H  -4.810434 1.296489 -0.817185
H  -4.261066 -0.029163 -1.909672
H  2.906523 2.540216 0.424723
H  1.13823 2.578916 0.040366
H  4.462133 -1.935046 -0.540997
H  3.48228 -1.753768 0.966252
H  0.407167 -0.65716 3.28959
H  -1.218917 -0.646036 4.048724
H  -0.417264 -2.203662 3.672263
H  -5.623143 -1.696396 -0.571374
H  -6.17223 -0.380413 0.514961
H  -6.671911 -0.390184 -1.206391
H  0.594998 1.834607 2.379456
H  2.346529 1.819752 2.798872
H  1.52588 3.364112 2.405769
H  2.280786 -3.925304 0.432127
H  3.255275 -4.100473 -1.059919
H  4.049056 -4.199354 0.545335
