program: Gaussian 09
title: 000076146
version: EM64L-G09RevD.01
frameworkgroup: C1[X(C7H6O3)]
method: RPBEPBE
basis: SDD
operation: Freq
keyword: #p
keyword: freq=noraman
keyword: PBEPBE/SDD
title: #p freq=noraman PBEPBE/SDD
converged: YES YES NO NO
title: Mulliken charges:
elementType: O O O C C C C C C C H H H H H H
charge: -0.250206 -0.204560 -0.214105 0.293824 0.083809 -0.446358 0.193351 -0.233171 -0.269286 -0.498003 0.284474 0.264829 0.267929 0.246097 0.234679 0.246698
chargesum: 0.00000
title: Mulliken charges with hydrogens summed into heavy atoms:
elementType: O O O C C C C C C C
charge: -0.250206 -0.204560 -0.214105 0.293824 0.083809 -0.161885 0.193351 0.031658 -0.001357 0.229471
polarizability: 1.44392252e+02 -1.44744719e+01 8.36580245e+01 6.17956847e-02 2.38048753e-02 3.80550515e+01
1716.lowfreq: -10.9740 -7.6217 -0.0001 0.0005 0.0006 6.6174 46.1625 86.9523 164.5748
frequency: 46.1179 86.9513 164.5742 213.5509 238.2172 271.7824 357.3923 369.6316 414.2824 417.7555 465.1483 604.8185 605.8653 646.0046 766.7312 775.0079 832.2790 847.0894 884.9551 953.1842 987.5724 1072.8448 1100.8423 1136.1785 1192.5444 1208.3926 1295.5932 1329.4988 1352.1401 1439.4813 1450.6812 1454.9681 1517.2737 1554.0658 1579.6884 1636.6809 3010.3772 3122.3018 3139.0839 3146.1017 3171.2646 3176.3091
redmass: 3.4692 6.0836 3.8303 1.2248 4.3302 4.6043 4.9757 10.1890 7.5540 3.5322 8.4051 4.7519 2.7817 7.2958 2.9588 5.1365 2.0507 5.5416 1.6132 4.0052 1.2855 1.9449 1.2396 1.3254 1.7136 2.2046 2.9914 2.8495 2.2309 1.1799 1.0718 1.0522 10.2475 8.7665 8.0147 7.0731 1.0282 1.1051 1.1063 1.0868 1.0999 1.0937
irintensity: 12.2937 3.3450 5.3654 0.8137 2.0819 0.0030 1.8773 10.0411 18.1067 0.2599 1.6981 11.7416 7.7014 7.5345 0.0279 1.1429 7.7299 17.7882 79.3479 6.2418 0.0981 118.7167 0.0646 2.1253 28.0979 192.4670 29.7978 55.7332 8.1037 13.4036 33.2173 13.8879 7.0988 275.9085 223.2546 7.4307 33.2142 23.3175 26.8826 0.7208 7.1734 0.2954
temp: 298.150 k
press: 1.00000 atm
elementType: 8 8 8 6 6 6 6 6 6 6 1 1 1 1 1 1
symmnumber: 1
zpe: 299277.1 jmol-1
zpe.correction: 0.113989 hartree
zpe.thermalcorrener: 0.123146 hartree
zpe.thermalcorrenthalpy: 0.124090 hartree
zpe.thermalcorrgfe: 0.079199 hartree
zpe.sumelectzpe: -495.237949 hartree
zpe.sumelectthermal: -495.228792 hartree
zpe.sumelectthermalent: -495.227848 hartree
zpe.sumelectthermalfe: -495.272739 hartree
dipole: -2.5968 1.3024 0.0244
dipole: 2.9052
quadrupole: -60.7123 -58.9214 -57.3532
quadrupole: 11.6983 -0.0522 0.0144
quadrupole: -1.7167 0.0742 1.6424 11.6983 -0.0522 0.0144
hfenergy: -495.3519381 hartree
pointgroup: C01 [X(C7H6O3)]
dipole: 1.0176579 -0.4158567 -0.3129079 debye
dipolederiv: -1.4320652 -0.2272836 0.1941981 -0.7422952 -0.4268939 0.1294989 0.075147 0.0176722 -0.3038142 -0.8287069 0.1338146 0.1494711 0.1852189 -0.5575871 -0.1028591 0.1618791 -0.0914677 -0.3585134 -1.0090136 -0.0240726 0.1425794 0.1755535 -0.4616677 -0.0688443 0.1909045 -0.0245622 -0.3827534 1.221065 0.4206373 -0.1375087 0.7866837 -0.0507738 -0.215409 -0.0530793 -0.1361074 0.1144871 0.9664449 -0.0439838 -0.1788338 -0.1993325 0.7462561 0.1703799 -0.213814 0.1360856 0.2953446 -0.9834163 -0.3439871 0.0893799 -0.2503066 -0.076197 0.0848759 0.1111399 0.1059338 -0.201449 1.2614793 0.2132453 -0.1846704 0.2583804 0.7322639 0.0711696 -0.1747897 0.0802403 0.2503981 -0.3825925 -0.1386543 0.0221166 -0.2156157 0.0236944 0.0854934 0.0031831 0.0689751 -0.1199431 0.247451 0.1031839 -0.0489215 0.0821603 -0.2365627 -0.0547541 -0.053857 -0.0591764 -0.084958 0.8457781 0.0885027 -0.0993022 0.0448021 0.2678234 -0.0142815 -0.1093363 -0.0231553 0.3061268 0.0836206 -0.0100255 0.0192255 -0.037064 -0.003168 -0.0356374 0.0128694 -0.041881 0.1684147 0.0843327 0.0202804 0.0218176 -0.0254407 -0.0370172 -0.0412344 0.0111697 -0.0514609 0.1458811 0.0031041 -0.0871173 0.0134648 -0.0526093 0.0370769 -0.0167039 0.0216101 -0.0090353 0.1499575 -0.0283296 0.0002454 0.002699 0.1006731 0.0146715 0.0917978 -0.000323 0.094809 -0.0070673 -0.0261566 -0.0778928 0.0126742 -0.1662839 -0.0638825 -0.0089931 -0.0093067 -0.0281601 0.1157138 -0.0229951 -0.0268927 -0.0183897 0.0554758 0.0919636 -0.0744986 0.0266032 -0.0387097 -0.0878252 unknown
polarizability: 140.6012048|-6.6583859|79.4220808|-24.1851048|11.322032|46.0820427 unknown
InChI: InChI=1S/C7H6O3/c1-10-7-4-5(8)2-3-6(7)9/h2-4H,1H3
charge 0 multiplicity 1
16 atoms
O  1.560206 1.519292 -0.178804
O  1.621767 -1.34546 -0.879864
O  -3.078454 0.960814 0.711222
C  0.467881 0.679549 -0.138869
C  0.54161 -0.786961 -0.505103
C  -0.733585 1.235954 0.257243
C  -1.965454 0.449696 0.343584
C  -0.717353 -1.569482 -0.41045
C  -1.893121 -1.001553 -0.015155
C  2.923971 1.088217 -0.570411
H  -0.786494 2.296419 0.520729
H  -0.629465 -2.627364 -0.680916
H  -2.828716 -1.566981 0.058638
H  3.299842 0.302534 0.103792
H  3.518112 2.009127 -0.47396
H  2.938853 0.714599 -1.606378
