program: Gaussian 09
title: 000076168
version: EM64L-G09RevD.01
frameworkgroup: C1[X(C16H12Cl2N2O)]
method: RPBEPBE
basis: SDD
operation: Freq
keyword: #p
keyword: freq=noraman
keyword: PBEPBE/SDD
title: #p freq=noraman PBEPBE/SDD
converged: YES YES NO NO
title: Mulliken charges:
elementType: Cl Cl O N N C C C C C C C C C C C C C C C C H H H H H H H H H H H H
charge: -0.048096 -0.051743 -0.235086 -0.214248 -0.010897 0.261716 0.272127 -0.032354 -0.591692 0.459239 0.163515 -0.320000 -0.319944 -0.641024 -0.128553 -0.244142 -0.325501 -0.364545 -0.225982 -0.235805 -0.224118 0.238261 0.272779 0.281467 0.250459 0.241636 0.230185 0.280326 0.261006 0.267085 0.258807 0.236909 0.238213
chargesum: 0.00000
title: Mulliken charges with hydrogens summed into heavy atoms:
elementType: Cl Cl O N N C C C C C C C C C C C C C C C C
charge: -0.048096 -0.051743 -0.235086 -0.214248 -0.010897 0.261716 0.272127 -0.032354 -0.080652 0.459239 0.163515 -0.038533 -0.069485 0.111123 -0.128553 0.016863 -0.325501 -0.097460 0.032825 0.001104 0.014096
polarizability: 2.53294838e+02 -1.38268884e+01 2.27674342e+02 2.02485997e+01 1.92356771e+01 1.53933715e+02
1716.lowfreq: -6.8747 -5.1830 -0.0021 -0.0017 -0.0010 3.7079 29.1903 41.4865 58.7100
frequency: 29.1645 41.4713 58.7061 63.2890 95.4378 112.5505 130.7827 141.7560 165.2297 198.3425 205.3777 230.2310 248.0796 282.0588 292.2356 324.5383 359.3389 377.2779 384.5804 397.0594 419.3609 457.2662 459.3136 468.6356 499.1917 522.5055 537.7569 578.5062 612.3940 635.7630 667.2014 678.2204 692.5078 720.9563 741.7995 757.8165 773.5957 785.7949 821.7650 871.8437 893.6638 901.1533 927.3136 951.1274 954.5349 970.8087 988.3522 991.7291 1020.9613 1039.3246 1064.8461 1090.9384 1113.8414 1120.3724 1126.4899 1137.1343 1166.7535 1173.1569 1199.4013 1250.9437 1255.4947 1277.2381 1302.5783 1307.1959 1329.1728 1366.3400 1377.1267 1387.7800 1420.7011 1425.2499 1458.6749 1459.6952 1463.7794 1471.5267 1496.3666 1548.5667 1566.2662 1576.8806 1594.2874 1602.1953 1618.8389 2946.9544 2987.3266 3082.8929 3111.2124 3128.0998 3140.3612 3154.7465 3157.3352 3162.2801 3168.0397 3177.6183 3178.1520
redmass: 10.0783 5.9925 7.9817 7.8620 4.0878 5.0920 4.9366 1.1471 5.8777 7.1358 5.4976 6.4022 6.2716 6.2609 4.6445 4.8803 5.5494 3.9403 5.6010 9.0133 4.9539 5.2557 4.9553 3.9783 3.9621 4.8160 3.6005 4.6427 5.2646 6.1069 5.8030 6.3032 6.4921 5.4309 2.9623 3.2895 1.7160 7.0371 1.4767 1.4026 1.9165 2.1106 3.9482 1.3429 1.4809 3.3976 2.9162 1.5675 6.8472 2.4263 3.1869 2.1928 1.3904 1.7438 1.7313 1.8121 1.8583 1.0572 1.3584 1.5732 1.6090 2.8835 3.0502 1.8503 1.7026 8.7063 8.7237 3.8897 2.2700 1.1967 1.9032 1.2054 1.1748 2.6293 1.0667 7.7543 6.4612 8.7301 6.9972 7.0831 8.3824 1.0684 1.0389 1.0948 1.0935 1.1025 1.0860 1.0906 1.0880 1.0924 1.0951 1.0973 1.1001
irintensity: 0.6850 1.3624 0.5088 2.4948 3.0592 1.7450 0.1659 0.5678 0.6457 2.2217 0.8890 0.3535 4.0804 1.9506 3.3831 3.0542 3.2749 5.5998 3.8448 5.1730 2.3534 7.2412 4.4673 11.2956 3.4458 13.7105 13.1306 6.5793 3.0045 9.6901 3.4481 5.8727 7.6020 3.9385 36.4135 14.4382 37.8858 61.5138 38.0615 0.2322 21.0369 7.0373 19.9372 0.7024 1.4510 1.3318 9.1270 3.7928 38.1020 3.5399 24.2826 15.5276 12.3038 30.1748 15.1147 3.5453 5.3290 0.7954 20.3995 5.2686 18.4335 62.8808 51.0400 30.2259 14.2876 1.8369 9.7461 42.9547 38.3861 26.8334 75.7532 13.4053 2.2878 109.1297 16.6851 25.4984 10.2682 12.1633 40.1040 15.1182 400.9886 28.1570 39.2943 17.8440 12.4171 2.3740 1.9408 9.3996 3.4399 0.3269 6.9122 5.2947 13.9674
temp: 298.150 k
press: 1.00000 atm
elementType: 17 17 8 7 7 6 6 6 6 6 6 6 6 6 6 6 6 6 6 6 6 1 1 1 1 1 1 1 1 1 1 1 1
symmnumber: 1
zpe: 631769.0 jmol-1
zpe.correction: 0.240628 hartree
zpe.thermalcorrener: 0.258822 hartree
zpe.thermalcorrenthalpy: 0.259767 hartree
zpe.thermalcorrgfe: 0.193331 hartree
zpe.sumelectzpe: -1720.280725 hartree
zpe.sumelectthermal: -1720.262531 hartree
zpe.sumelectthermalent: -1720.261587 hartree
zpe.sumelectthermalfe: -1720.328022 hartree
dipole: -0.7503 2.6927 -0.0391
dipole: 2.7955
quadrupole: -113.9338 -157.9615 -129.6159
quadrupole: 13.7329 5.5242 2.8251
quadrupole: 19.9032 -24.1244 4.2212 13.7329 5.5242 2.8251
hfenergy: -1720.5213533 hartree
pointgroup: C01 [X(C16H12Cl2N2O1)]
dipole: -0.2095322 -1.0525718 -0.2404765 debye
polarizability: 251.6436322|19.6396011|217.7799067|-15.8892686|33.312769|165.4793564 unknown
InChI: InChI=1S/C16H12Cl2N2O/c1-20-14-7-6-10(17)8-12(14)16(19-9-15(20)21)11-4-2-3-5-13(11)18/h2-8H,9H2,1H3
charge 0 multiplicity 1
33 atoms
Cl 0.417899 -4.671518 -0.471688
Cl -1.13162 0.116013 -2.461655
O  2.823369 3.091961 0.84608
N  2.425815 1.058347 -0.229149
N  -0.064969 1.396263 1.499089
C  0.584092 -0.601896 0.165137
C  1.924551 -0.281906 -0.227955
C  -0.376224 0.429047 0.661614
C  1.337027 1.484333 1.969439
C  -1.82335 0.326038 0.277472
C  2.258326 1.96488 0.839127
C  0.142216 -1.950664 0.080899
C  2.764684 -1.318848 -0.71934
C  3.325352 1.484291 -1.328854
C  1.005241 -2.949598 -0.385889
C  2.319068 -2.650047 -0.799766
C  -2.293539 0.14894 -1.047746
C  -2.803305 0.443806 1.302089
C  -3.665369 0.061911 -1.354609
C  -4.180689 0.357129 1.018984
C  -4.614076 0.156717 -0.312176
H  1.708792 0.507222 2.349079
H  1.392971 2.233761 2.771562
H  -0.882708 -2.198406 0.371754
H  3.785886 -1.083787 -1.032658
H  2.974816 1.050012 -2.27838
H  4.374909 1.185919 -1.146729
H  3.294623 2.583423 -1.378985
H  2.980666 -3.438006 -1.170503
H  -2.447656 0.6141 2.322903
H  -3.983922 -0.063775 -2.393265
H  -4.911434 0.44644 1.829241
H  -5.681444 0.085699 -0.546323
